Build Failure: DataBindingExample_Flat: Unable to find artifact

classic Classic list List threaded Threaded
8 messages Options
Reply | Threaded
Open this post in threaded view
|

Build Failure: DataBindingExample_Flat: Unable to find artifact

T-san
I run "mvn clean install" at C:\apache-royale-0.9.6-bin-js\royale-asjs\examples on Windows 10 with Japanese.  Build failed with the following console.

This is the first time build of Apache Royale examples on this machine.  I cannot fine the subject WAR file in the designated link.  What's w

*****************************************************************************************************************************************************************************************************

[INFO] ------------------------------------------------------------------------
[INFO] BUILD FAILURE
[INFO] ------------------------------------------------------------------------
[INFO] Total time:  19:06 min
[INFO] Finished at: 2019-10-27T14:01:01+09:00
[INFO] ------------------------------------------------------------------------
[ERROR] Failed to execute goal org.apache.maven.plugins:maven-dependency-plugin:2.10:unpack (unpack-fonts) on project DataBindingExample_Flat: Unable to find artifact.: Could not find artifact org.apache.royale.framework:Fonts:war:0.9.6-SNAPSHOT in apache-snapshots (https://repository.apache.org/content/repositories/snapshots)
[ERROR]
[ERROR] Try downloading the file manually from the project website.
[ERROR]
[ERROR] Then, install it using the command:
[ERROR]     mvn install:install-file -DgroupId=org.apache.royale.framework -DartifactId=Fonts -Dversion=0.9.6-SNAPSHOT -Dpackaging=war -Dfile=/path/to/file
--
Shoichiro Takeshita
Reply | Threaded
Open this post in threaded view
|

Re: Build Failure: DataBindingExample_Flat: Unable to find artifact

Alex Harui-2

Hi T-San,

 

Where did you get the source?  Did you run “mvn clean install” in the royale-asjs folder first?

 

-Alex

 

From: Takeshita Shoichiro <[hidden email]>
Reply-To: "[hidden email]" <[hidden email]>
Date: Saturday, October 26, 2019 at 10:17 PM
To: "[hidden email]" <[hidden email]>
Subject: Build Failure: DataBindingExample_Flat: Unable to find artifact

 

I run "mvn clean install" at C:\apache-royale-0.9.6-bin-js\royale-asjs\examples on Windows 10 with Japanese.  Build failed with the following console.

 

This is the first time build of Apache Royale examples on this machine.  I cannot fine the subject WAR file in the designated link.  What's w

 

*****************************************************************************************************************************************************************************************************


[INFO] ------------------------------------------------------------------------
[INFO] BUILD FAILURE
[INFO] ------------------------------------------------------------------------
[INFO] Total time:  19:06 min
[INFO] Finished at: 2019-10-27T14:01:01+09:00
[INFO] ------------------------------------------------------------------------
[ERROR] Failed to execute goal org.apache.maven.plugins:maven-dependency-plugin:2.10:unpack (unpack-fonts) on project DataBindingExample_Flat: Unable to find artifact.: Could not find artifact org.apache.royale.framework:Fonts:war:0.9.6-SNAPSHOT in apache-snapshots (https://repository.apache.org/content/repositories/snapshots)
[ERROR]
[ERROR] Try downloading the file manually from the project website.
[ERROR]
[ERROR] Then, install it using the command:
[ERROR]     mvn install:install-file -DgroupId=org.apache.royale.framework -DartifactId=Fonts -Dversion=0.9.6-SNAPSHOT -Dpackaging=war -Dfile=/path/to/file

--

Shoichiro Takeshita

Reply | Threaded
Open this post in threaded view
|

Re: Build Failure: DataBindingExample_Flat: Unable to find artifact

T-san
Alex, from the official Apache Royale download page.

I run mvn clean install at Royale-asjs¥examples.



2019年10月27日(日) 15:01 Alex Harui <[hidden email]>:

Hi T-San,

 

Where did you get the source?  Did you run “mvn clean install” in the royale-asjs folder first?

 

-Alex

 

From: Takeshita Shoichiro <[hidden email]>
Reply-To: "[hidden email]" <[hidden email]>
Date: Saturday, October 26, 2019 at 10:17 PM
To: "[hidden email]" <[hidden email]>
Subject: Build Failure: DataBindingExample_Flat: Unable to find artifact

 

I run "mvn clean install" at C:\apache-royale-0.9.6-bin-js\royale-asjs\examples on Windows 10 with Japanese.  Build failed with the following console.

 

This is the first time build of Apache Royale examples on this machine.  I cannot fine the subject WAR file in the designated link.  What's w

 

*****************************************************************************************************************************************************************************************************


[INFO] ------------------------------------------------------------------------
[INFO] BUILD FAILURE
[INFO] ------------------------------------------------------------------------
[INFO] Total time:  19:06 min
[INFO] Finished at: 2019-10-27T14:01:01+09:00
[INFO] ------------------------------------------------------------------------
[ERROR] Failed to execute goal org.apache.maven.plugins:maven-dependency-plugin:2.10:unpack (unpack-fonts) on project DataBindingExample_Flat: Unable to find artifact.: Could not find artifact org.apache.royale.framework:Fonts:war:0.9.6-SNAPSHOT in apache-snapshots (https://repository.apache.org/content/repositories/snapshots)
[ERROR]
[ERROR] Try downloading the file manually from the project website.
[ERROR]
[ERROR] Then, install it using the command:
[ERROR]     mvn install:install-file -DgroupId=org.apache.royale.framework -DartifactId=Fonts -Dversion=0.9.6-SNAPSHOT -Dpackaging=war -Dfile=/path/to/file

--

Shoichiro Takeshita

--
Shoichiro Takeshita
武下 祥一郎
Reply | Threaded
Open this post in threaded view
|

Re: Build Failure: DataBindingExample_Flat: Unable to find artifact

Alex Harui-2

That looks like a bug to me.  Please open a github issue.

 

I think you can just change the royale.framework.version in examples/pom.xml and remove the -SNAPSHOT

 

Thanks,

-Alex

 

From: Takeshita Shoichiro <[hidden email]>
Reply-To: "[hidden email]" <[hidden email]>
Date: Saturday, October 26, 2019 at 11:15 PM
To: "[hidden email]" <[hidden email]>
Subject: Re: Build Failure: DataBindingExample_Flat: Unable to find artifact

 

Alex, from the official Apache Royale download page.

 

I run mvn clean install at Royale-asjs¥examples.

 

 

 

20191027() 15:01 Alex Harui <[hidden email]>:

Hi T-San,

 

Where did you get the source?  Did you run “mvn clean install” in the royale-asjs folder first?

 

-Alex

 

From: Takeshita Shoichiro <[hidden email]>
Reply-To: "[hidden email]" <[hidden email]>
Date: Saturday, October 26, 2019 at 10:17 PM
To: "[hidden email]" <[hidden email]>
Subject: Build Failure: DataBindingExample_Flat: Unable to find artifact

 

I run "mvn clean install" at C:\apache-royale-0.9.6-bin-js\royale-asjs\examples on Windows 10 with Japanese.  Build failed with the following console.

 

This is the first time build of Apache Royale examples on this machine.  I cannot fine the subject WAR file in the designated link.  What's w

 

*****************************************************************************************************************************************************************************************************


[INFO] ------------------------------------------------------------------------
[INFO] BUILD FAILURE
[INFO] ------------------------------------------------------------------------
[INFO] Total time:  19:06 min
[INFO] Finished at: 2019-10-27T14:01:01+09:00
[INFO] ------------------------------------------------------------------------
[ERROR] Failed to execute goal org.apache.maven.plugins:maven-dependency-plugin:2.10:unpack (unpack-fonts) on project DataBindingExample_Flat: Unable to find artifact.: Could not find artifact org.apache.royale.framework:Fonts:war:0.9.6-SNAPSHOT in apache-snapshots (https://repository.apache.org/content/repositories/snapshots)
[ERROR]
[ERROR] Try downloading the file manually from the project website.
[ERROR]
[ERROR] Then, install it using the command:
[ERROR]     mvn install:install-file -DgroupId=org.apache.royale.framework -DartifactId=Fonts -Dversion=0.9.6-SNAPSHOT -Dpackaging=war -Dfile=/path/to/file

--

Shoichiro Takeshita

--

Shoichiro Takeshita
武下 祥一郎

Reply | Threaded
Open this post in threaded view
|

Re: Build Failure: DataBindingExample_Flat: Unable to find artifact

T-san
Alex, thanks.  The problem was fixed. I opened issue 530.

2019年10月27日(日) 23:45 Alex Harui <[hidden email]>:

That looks like a bug to me.  Please open a github issue.

 

I think you can just change the royale.framework.version in examples/pom.xml and remove the -SNAPSHOT

 

Thanks,

-Alex

 

From: Takeshita Shoichiro <[hidden email]>
Reply-To: "[hidden email]" <[hidden email]>
Date: Saturday, October 26, 2019 at 11:15 PM
To: "[hidden email]" <[hidden email]>
Subject: Re: Build Failure: DataBindingExample_Flat: Unable to find artifact

 

Alex, from the official Apache Royale download page.

 

I run mvn clean install at Royale-asjs¥examples.

 

 

 

20191027() 15:01 Alex Harui <[hidden email]>:

Hi T-San,

 

Where did you get the source?  Did you run “mvn clean install” in the royale-asjs folder first?

 

-Alex

 

From: Takeshita Shoichiro <[hidden email]>
Reply-To: "[hidden email]" <[hidden email]>
Date: Saturday, October 26, 2019 at 10:17 PM
To: "[hidden email]" <[hidden email]>
Subject: Build Failure: DataBindingExample_Flat: Unable to find artifact

 

I run "mvn clean install" at C:\apache-royale-0.9.6-bin-js\royale-asjs\examples on Windows 10 with Japanese.  Build failed with the following console.

 

This is the first time build of Apache Royale examples on this machine.  I cannot fine the subject WAR file in the designated link.  What's w

 

*****************************************************************************************************************************************************************************************************


[INFO] ------------------------------------------------------------------------
[INFO] BUILD FAILURE
[INFO] ------------------------------------------------------------------------
[INFO] Total time:  19:06 min
[INFO] Finished at: 2019-10-27T14:01:01+09:00
[INFO] ------------------------------------------------------------------------
[ERROR] Failed to execute goal org.apache.maven.plugins:maven-dependency-plugin:2.10:unpack (unpack-fonts) on project DataBindingExample_Flat: Unable to find artifact.: Could not find artifact org.apache.royale.framework:Fonts:war:0.9.6-SNAPSHOT in apache-snapshots (https://repository.apache.org/content/repositories/snapshots)
[ERROR]
[ERROR] Try downloading the file manually from the project website.
[ERROR]
[ERROR] Then, install it using the command:
[ERROR]     mvn install:install-file -DgroupId=org.apache.royale.framework -DartifactId=Fonts -Dversion=0.9.6-SNAPSHOT -Dpackaging=war -Dfile=/path/to/file

--

Shoichiro Takeshita

--

Shoichiro Takeshita
武下 祥一郎

--
Shoichiro Takeshita
武下 祥一郎
Reply | Threaded
Open this post in threaded view
|

Re: Build Failure: DataBindingExample_Flat: Unable to find artifact

Alex Harui-2

Thanks for finding that.  I still haven’t figured out why it worked for me.

 

-Alex

 

From: Takeshita Shoichiro <[hidden email]>
Reply-To: "[hidden email]" <[hidden email]>
Date: Sunday, October 27, 2019 at 6:40 PM
To: "[hidden email]" <[hidden email]>
Subject: Re: Build Failure: DataBindingExample_Flat: Unable to find artifact

 

Alex, thanks.  The problem was fixed. I opened issue 530.

 

20191027() 23:45 Alex Harui <[hidden email]>:

That looks like a bug to me.  Please open a github issue.

 

I think you can just change the royale.framework.version in examples/pom.xml and remove the -SNAPSHOT

 

Thanks,

-Alex

 

From: Takeshita Shoichiro <[hidden email]>
Reply-To: "[hidden email]" <[hidden email]>
Date: Saturday, October 26, 2019 at 11:15 PM
To: "[hidden email]" <[hidden email]>
Subject: Re: Build Failure: DataBindingExample_Flat: Unable to find artifact

 

Alex, from the official Apache Royale download page.

 

I run mvn clean install at Royale-asjs¥examples.

 

 

 

20191027() 15:01 Alex Harui <[hidden email]>:

Hi T-San,

 

Where did you get the source?  Did you run “mvn clean install” in the royale-asjs folder first?

 

-Alex

 

From: Takeshita Shoichiro <[hidden email]>
Reply-To: "[hidden email]" <[hidden email]>
Date: Saturday, October 26, 2019 at 10:17 PM
To: "[hidden email]" <[hidden email]>
Subject: Build Failure: DataBindingExample_Flat: Unable to find artifact

 

I run "mvn clean install" at C:\apache-royale-0.9.6-bin-js\royale-asjs\examples on Windows 10 with Japanese.  Build failed with the following console.

 

This is the first time build of Apache Royale examples on this machine.  I cannot fine the subject WAR file in the designated link.  What's w

 

*****************************************************************************************************************************************************************************************************


[INFO] ------------------------------------------------------------------------
[INFO] BUILD FAILURE
[INFO] ------------------------------------------------------------------------
[INFO] Total time:  19:06 min
[INFO] Finished at: 2019-10-27T14:01:01+09:00
[INFO] ------------------------------------------------------------------------
[ERROR] Failed to execute goal org.apache.maven.plugins:maven-dependency-plugin:2.10:unpack (unpack-fonts) on project DataBindingExample_Flat: Unable to find artifact.: Could not find artifact org.apache.royale.framework:Fonts:war:0.9.6-SNAPSHOT in apache-snapshots (https://repository.apache.org/content/repositories/snapshots)
[ERROR]
[ERROR] Try downloading the file manually from the project website.
[ERROR]
[ERROR] Then, install it using the command:
[ERROR]     mvn install:install-file -DgroupId=org.apache.royale.framework -DartifactId=Fonts -Dversion=0.9.6-SNAPSHOT -Dpackaging=war -Dfile=/path/to/file

--

Shoichiro Takeshita

--

Shoichiro Takeshita
武下 祥一郎

--

Shoichiro Takeshita
武下 祥一郎

Reply | Threaded
Open this post in threaded view
|

Re: Build Failure: DataBindingExample_Flat: Unable to find artifact

T-san
Alex, this time I used Windows 10. A week or so before, I run on Macbook.  At that time, I think I did not get a build failure. If I have time, will build on the Mac at home tonight.

2019年10月28日(月) 15:14 Alex Harui <[hidden email]>:

Thanks for finding that.  I still haven’t figured out why it worked for me.

 

-Alex

 

From: Takeshita Shoichiro <[hidden email]>
Reply-To: "[hidden email]" <[hidden email]>
Date: Sunday, October 27, 2019 at 6:40 PM
To: "[hidden email]" <[hidden email]>
Subject: Re: Build Failure: DataBindingExample_Flat: Unable to find artifact

 

Alex, thanks.  The problem was fixed. I opened issue 530.

 

20191027() 23:45 Alex Harui <[hidden email]>:

That looks like a bug to me.  Please open a github issue.

 

I think you can just change the royale.framework.version in examples/pom.xml and remove the -SNAPSHOT

 

Thanks,

-Alex

 

From: Takeshita Shoichiro <[hidden email]>
Reply-To: "[hidden email]" <[hidden email]>
Date: Saturday, October 26, 2019 at 11:15 PM
To: "[hidden email]" <[hidden email]>
Subject: Re: Build Failure: DataBindingExample_Flat: Unable to find artifact

 

Alex, from the official Apache Royale download page.

 

I run mvn clean install at Royale-asjs¥examples.

 

 

 

20191027() 15:01 Alex Harui <[hidden email]>:

Hi T-San,

 

Where did you get the source?  Did you run “mvn clean install” in the royale-asjs folder first?

 

-Alex

 

From: Takeshita Shoichiro <[hidden email]>
Reply-To: "[hidden email]" <[hidden email]>
Date: Saturday, October 26, 2019 at 10:17 PM
To: "[hidden email]" <[hidden email]>
Subject: Build Failure: DataBindingExample_Flat: Unable to find artifact

 

I run "mvn clean install" at C:\apache-royale-0.9.6-bin-js\royale-asjs\examples on Windows 10 with Japanese.  Build failed with the following console.

 

This is the first time build of Apache Royale examples on this machine.  I cannot fine the subject WAR file in the designated link.  What's w

 

*****************************************************************************************************************************************************************************************************


[INFO] ------------------------------------------------------------------------
[INFO] BUILD FAILURE
[INFO] ------------------------------------------------------------------------
[INFO] Total time:  19:06 min
[INFO] Finished at: 2019-10-27T14:01:01+09:00
[INFO] ------------------------------------------------------------------------
[ERROR] Failed to execute goal org.apache.maven.plugins:maven-dependency-plugin:2.10:unpack (unpack-fonts) on project DataBindingExample_Flat: Unable to find artifact.: Could not find artifact org.apache.royale.framework:Fonts:war:0.9.6-SNAPSHOT in apache-snapshots (https://repository.apache.org/content/repositories/snapshots)
[ERROR]
[ERROR] Try downloading the file manually from the project website.
[ERROR]
[ERROR] Then, install it using the command:
[ERROR]     mvn install:install-file -DgroupId=org.apache.royale.framework -DartifactId=Fonts -Dversion=0.9.6-SNAPSHOT -Dpackaging=war -Dfile=/path/to/file

--

Shoichiro Takeshita

--

Shoichiro Takeshita
武下 祥一郎

--

Shoichiro Takeshita
武下 祥一郎

--
Shoichiro Takeshita
武下 祥一郎
Reply | Threaded
Open this post in threaded view
|

Re: Build Failure: DataBindingExample_Flat: Unable to find artifact

T-san
In reply to this post by Alex Harui-2
Alex,

Build on MacBook has no problem without fix.  Just for your info.

On Mon, Oct 28, 2019 at 3:14 PM Alex Harui <[hidden email]> wrote:

Thanks for finding that.  I still haven’t figured out why it worked for me.

 

-Alex

 

From: Takeshita Shoichiro <[hidden email]>
Reply-To: "[hidden email]" <[hidden email]>
Date: Sunday, October 27, 2019 at 6:40 PM
To: "[hidden email]" <[hidden email]>
Subject: Re: Build Failure: DataBindingExample_Flat: Unable to find artifact

 

Alex, thanks.  The problem was fixed. I opened issue 530.

 

20191027() 23:45 Alex Harui <[hidden email]>:

That looks like a bug to me.  Please open a github issue.

 

I think you can just change the royale.framework.version in examples/pom.xml and remove the -SNAPSHOT

 

Thanks,

-Alex

 

From: Takeshita Shoichiro <[hidden email]>
Reply-To: "[hidden email]" <[hidden email]>
Date: Saturday, October 26, 2019 at 11:15 PM
To: "[hidden email]" <[hidden email]>
Subject: Re: Build Failure: DataBindingExample_Flat: Unable to find artifact

 

Alex, from the official Apache Royale download page.

 

I run mvn clean install at Royale-asjs¥examples.

 

 

 

20191027() 15:01 Alex Harui <[hidden email]>:

Hi T-San,

 

Where did you get the source?  Did you run “mvn clean install” in the royale-asjs folder first?

 

-Alex

 

From: Takeshita Shoichiro <[hidden email]>
Reply-To: "[hidden email]" <[hidden email]>
Date: Saturday, October 26, 2019 at 10:17 PM
To: "[hidden email]" <[hidden email]>
Subject: Build Failure: DataBindingExample_Flat: Unable to find artifact

 

I run "mvn clean install" at C:\apache-royale-0.9.6-bin-js\royale-asjs\examples on Windows 10 with Japanese.  Build failed with the following console.

 

This is the first time build of Apache Royale examples on this machine.  I cannot fine the subject WAR file in the designated link.  What's w

 

*****************************************************************************************************************************************************************************************************


[INFO] ------------------------------------------------------------------------
[INFO] BUILD FAILURE
[INFO] ------------------------------------------------------------------------
[INFO] Total time:  19:06 min
[INFO] Finished at: 2019-10-27T14:01:01+09:00
[INFO] ------------------------------------------------------------------------
[ERROR] Failed to execute goal org.apache.maven.plugins:maven-dependency-plugin:2.10:unpack (unpack-fonts) on project DataBindingExample_Flat: Unable to find artifact.: Could not find artifact org.apache.royale.framework:Fonts:war:0.9.6-SNAPSHOT in apache-snapshots (https://repository.apache.org/content/repositories/snapshots)
[ERROR]
[ERROR] Try downloading the file manually from the project website.
[ERROR]
[ERROR] Then, install it using the command:
[ERROR]     mvn install:install-file -DgroupId=org.apache.royale.framework -DartifactId=Fonts -Dversion=0.9.6-SNAPSHOT -Dpackaging=war -Dfile=/path/to/file

--

Shoichiro Takeshita

--

Shoichiro Takeshita
武下 祥一郎

--

Shoichiro Takeshita
武下 祥一郎



--
Shoichiro Takeshita
武下 祥一郎