Royale Build Issue

classic Classic list List threaded Threaded
64 messages Options
1234
Reply | Threaded
Open this post in threaded view
|

Royale Build Issue

alina kazi-2

Hi Alex,

 

After windows reinstallation and copying .pbj files.

 

With configuration :

check-playerglobal-home:

     [echo] PLAYERGLOBAL_HOME is D:\playerglobal\player

     [echo] playerglobal.version is 11.1

     [echo] playerglobal.swc is D:\playerglobal\player/11.1/playerglobal.swc

 

check-air-home:

     [echo] AIR_HOME is D:\AdobeAIRSDK\bin

 

check-compiler-home:

     [echo] env.ROYALE_COMPILER_REPO is ${env.ROYALE_COMPILER_REPO}

     [echo] ROYALE_COMPILER_REPO is ${ROYALE_COMPILER_REPO}

     [echo] ROYALE_COMPILER_REPO is d:\Apache\royale-asjs/../royale-compiler

 

check-compile-env:

     [echo] OS: Windows 7 / 6.1 / amd64

     [echo] VM: Java HotSpot(TM) 64-Bit Server VM / 25.31-b07

     [echo] Java: 1.8.0_31

     [echo] Ant: Apache Ant(TM) version 1.10.2 compiled on February 3 2018 Ant Java Version: 1.8

 

And environment variable path:

PATH=C:\Windows\system32;C:\Windows;C:\Windows\System32\Wbem;C:\Windows\System32

\WindowsPowerShell\v1.0;C:\Program Files\Java\jdk1.8.0_31\bin;D:\apache-ant-1.10.2\bin;C:\Program Files\Git\cmd;D:\apache-maven-3.5.3\bin

 

Still getting Errors.

 

Please share git , maven , ant, java version.

 

Thanks,

Alina

____________________________________________________

From: Alex Harui [mailto:[hidden email]]
Sent: Friday, March 09, 2018 12:12 PM
To: [hidden email]
Subject: Re: EMULATION

 

Hi Alina,

 

I think you've downloaded a nightly build at some point.  To workaround the pixel bender problem, try copying all .pbj files from the nightly to the same folders in royale-asjs.

 

HTH,

-Alex

 

From: Alina Kazi <[hidden email]>
Reply-To: "[hidden email]" <[hidden email]>
Date: Thursday, March 8, 2018 at 10:42 PM
To: "[hidden email]" <[hidden email]>
Subject: RE: EMULATION

 

Hi Alex,

I am using Apache Ant(TM) version 1.10.1 compiled on February 2 2017 Ant Java Version: 1.8

After Downloading file manually still issue is not resolved.

 

I am reinstalling the operating system Again.

 

Thanks,

Alina

 

From: Alex Harui [[hidden email]]
Sent: Friday, March 09, 2018 10:55 AM
To: [hidden email]
Subject: Re: EMULATION

 

Hi Alina,

 

I'm not sure why you are having problems with the downloads.  Could be your distance from the actual servers or some issue with Ant.  What version of Ant are you running?

 

The mirror.json part is just trying to download this file apache-flex-sdk-pixel-bender-1.0.0-bin.zip into the "in" folder.  Try doing that manually and see if the build goes past that point.

 

Thanks,

-Alex

 

From: Alina Kazi <[hidden email]>
Reply-To: "[hidden email]" <[hidden email]>
Date: Thursday, March 8, 2018 at 9:28 PM
To: "[hidden email]" <[hidden email]>
Subject: RE: EMULATION

 

Hi Alex,

 

 

Fetched all(3) folders from git 2 days earlier , while executing “ant all” or “ant” or “maven …..” Some Errors are occurred.

During the execution of ant all , Auto download wasn’t working So,Downloaded many files manually as the url was present right before the error every time and copying file to folder path that is also mention .

Now getting Error in mirror.json downloading.

https://www.dropbox.com/s/gv9wcvixr9mkcv9/error%20executing%20ant.png?dl=0

 

Thanks,

Alina

 

Reply | Threaded
Open this post in threaded view
|

Re: Royale Build Issue

Alex Harui-2
What errors are you getting now?

From: Alina Kazi <[hidden email]>
Reply-To: "[hidden email]" <[hidden email]>
Date: Monday, March 12, 2018 at 2:57 AM
To: "[hidden email]" <[hidden email]>
Subject: Royale Build Issue

Hi Alex,

 

After windows reinstallation and copying .pbj files.

 

With configuration :

check-playerglobal-home:

     [echo] PLAYERGLOBAL_HOME is D:\playerglobal\player

     [echo] playerglobal.version is 11.1

     [echo] playerglobal.swc is D:\playerglobal\player/11.1/playerglobal.swc

 

check-air-home:

     [echo] AIR_HOME is D:\AdobeAIRSDK\bin

 

check-compiler-home:

     [echo] env.ROYALE_COMPILER_REPO is ${env.ROYALE_COMPILER_REPO}

     [echo] ROYALE_COMPILER_REPO is ${ROYALE_COMPILER_REPO}

     [echo] ROYALE_COMPILER_REPO is d:\Apache\royale-asjs/../royale-compiler

 

check-compile-env:

     [echo] OS: Windows 7 / 6.1 / amd64

     [echo] VM: Java HotSpot(TM) 64-Bit Server VM / 25.31-b07

     [echo] Java: 1.8.0_31

     [echo] Ant: Apache Ant(TM) version 1.10.2 compiled on February 3 2018 Ant Java Version: 1.8

 

And environment variable path:

PATH=C:\Windows\system32;C:\Windows;C:\Windows\System32\Wbem;C:\Windows\System32

\WindowsPowerShell\v1.0;C:\Program Files\Java\jdk1.8.0_31\bin;D:\apache-ant-1.10.2\bin;C:\Program Files\Git\cmd;D:\apache-maven-3.5.3\bin

 

Still getting Errors.

 

Please share git , maven , ant, java version.

 

Thanks,

Alina

____________________________________________________

From: Alex Harui [[hidden email]]
Sent: Friday, March 09, 2018 12:12 PM
To: [hidden email]
Subject: Re: EMULATION

 

Hi Alina,

 

I think you've downloaded a nightly build at some point.  To workaround the pixel bender problem, try copying all .pbj files from the nightly to the same folders in royale-asjs.

 

HTH,

-Alex

 

From: Alina Kazi <[hidden email]>
Reply-To: "[hidden email]" <[hidden email]>
Date: Thursday, March 8, 2018 at 10:42 PM
To: "[hidden email]" <[hidden email]>
Subject: RE: EMULATION

 

Hi Alex,

I am using Apache Ant(TM) version 1.10.1 compiled on February 2 2017 Ant Java Version: 1.8

After Downloading file manually still issue is not resolved.

 

I am reinstalling the operating system Again.

 

Thanks,

Alina

 

From: Alex Harui [[hidden email]]
Sent: Friday, March 09, 2018 10:55 AM
To: [hidden email]
Subject: Re: EMULATION

 

Hi Alina,

 

I'm not sure why you are having problems with the downloads.  Could be your distance from the actual servers or some issue with Ant.  What version of Ant are you running?

 

The mirror.json part is just trying to download this file apache-flex-sdk-pixel-bender-1.0.0-bin.zip into the "in" folder.  Try doing that manually and see if the build goes past that point.

 

Thanks,

-Alex

 

From: Alina Kazi <[hidden email]>
Reply-To: "[hidden email]" <[hidden email]>
Date: Thursday, March 8, 2018 at 9:28 PM
To: "[hidden email]" <[hidden email]>
Subject: RE: EMULATION

 

Hi Alex,

 

 

Fetched all(3) folders from git 2 days earlier , while executing “ant all” or “ant” or “maven …..” Some Errors are occurred.

During the execution of ant all , Auto download wasn’t working So,Downloaded many files manually as the url was present right before the error every time and copying file to folder path that is also mention .

Now getting Error in mirror.json downloading.

https://www.dropbox.com/s/gv9wcvixr9mkcv9/error%20executing%20ant.png?dl=0

 

Thanks,

Alina

 

Reply | Threaded
Open this post in threaded view
|

RE: Royale Build Issue

alina kazi-2

https://www.dropbox.com/s/gv9wcvixr9mkcv9/error%20executing%20ant.png?dl=0

Even after downloading this file apache-flex-sdk-pixel-bender-1.0.0-bin.zip into the "in" folder.  

 

Thanks ,

Alina

 

From: Alex Harui [mailto:[hidden email]]
Sent: Monday, March 12, 2018 9:06 PM
To: [hidden email]
Subject: Re: Royale Build Issue

 

What errors are you getting now?

 

From: Alina Kazi <[hidden email]>
Reply-To: "[hidden email]" <[hidden email]>
Date: Monday, March 12, 2018 at 2:57 AM
To: "[hidden email]" <[hidden email]>
Subject: Royale Build Issue

 

Hi Alex,

 

After windows reinstallation and copying .pbj files.

 

With configuration :

check-playerglobal-home:

     [echo] PLAYERGLOBAL_HOME is D:\playerglobal\player

     [echo] playerglobal.version is 11.1

     [echo] playerglobal.swc is D:\playerglobal\player/11.1/playerglobal.swc

 

check-air-home:

     [echo] AIR_HOME is D:\AdobeAIRSDK\bin

 

check-compiler-home:

     [echo] env.ROYALE_COMPILER_REPO is ${env.ROYALE_COMPILER_REPO}

     [echo] ROYALE_COMPILER_REPO is ${ROYALE_COMPILER_REPO}

     [echo] ROYALE_COMPILER_REPO is d:\Apache\royale-asjs/../royale-compiler

 

check-compile-env:

     [echo] OS: Windows 7 / 6.1 / amd64

     [echo] VM: Java HotSpot(TM) 64-Bit Server VM / 25.31-b07

     [echo] Java: 1.8.0_31

     [echo] Ant: Apache Ant(TM) version 1.10.2 compiled on February 3 2018 Ant Java Version: 1.8

 

And environment variable path:

PATH=C:\Windows\system32;C:\Windows;C:\Windows\System32\Wbem;C:\Windows\System32

\WindowsPowerShell\v1.0;C:\Program Files\Java\jdk1.8.0_31\bin;D:\apache-ant-1.10.2\bin;C:\Program Files\Git\cmd;D:\apache-maven-3.5.3\bin

 

Still getting Errors.

 

Please share git , maven , ant, java version.

 

Thanks,

Alina

____________________________________________________

From: Alex Harui [[hidden email]]
Sent: Friday, March 09, 2018 12:12 PM
To: [hidden email]
Subject: Re: EMULATION

 

Hi Alina,

 

I think you've downloaded a nightly build at some point.  To workaround the pixel bender problem, try copying all .pbj files from the nightly to the same folders in royale-asjs.

 

HTH,

-Alex

 

From: Alina Kazi <[hidden email]>
Reply-To: "[hidden email]" <[hidden email]>
Date: Thursday, March 8, 2018 at 10:42 PM
To: "[hidden email]" <[hidden email]>
Subject: RE: EMULATION

 

Hi Alex,

I am using Apache Ant(TM) version 1.10.1 compiled on February 2 2017 Ant Java Version: 1.8

After Downloading file manually still issue is not resolved.

 

I am reinstalling the operating system Again.

 

Thanks,

Alina

 

From: Alex Harui [[hidden email]]
Sent: Friday, March 09, 2018 10:55 AM
To: [hidden email]
Subject: Re: EMULATION

 

Hi Alina,

 

I'm not sure why you are having problems with the downloads.  Could be your distance from the actual servers or some issue with Ant.  What version of Ant are you running?

 

The mirror.json part is just trying to download this file apache-flex-sdk-pixel-bender-1.0.0-bin.zip into the "in" folder.  Try doing that manually and see if the build goes past that point.

 

Thanks,

-Alex

 

From: Alina Kazi <[hidden email]>
Reply-To: "[hidden email]" <[hidden email]>
Date: Thursday, March 8, 2018 at 9:28 PM
To: "[hidden email]" <[hidden email]>
Subject: RE: EMULATION

 

Hi Alex,

 

 

Fetched all(3) folders from git 2 days earlier , while executing “ant all” or “ant” or “maven …..” Some Errors are occurred.

During the execution of ant all , Auto download wasn’t working So,Downloaded many files manually as the url was present right before the error every time and copying file to folder path that is also mention .

Now getting Error in mirror.json downloading.

https://www.dropbox.com/s/gv9wcvixr9mkcv9/error%20executing%20ant.png?dl=0

 

Thanks,

Alina

 

Reply | Threaded
Open this post in threaded view
|

Re: Royale Build Issue

Alex Harui-2
Hi Alina,

As I mentioned a couple of posts ago, it is better to copy the .pbj files.  Having the zip in the "in" folder won't prevent the script from trying to download pixel bender.

To verify that you have copied the .pbj files correctly, in Windows command prompt do:

dir /s *.pbj

There should be a set of .pbj files in frameworks/projects/Graphics/src/main/royale/org/apache/royale/graphics/utils/shaderClasses/

HTH,
-Alex

From: Alina Kazi <[hidden email]>
Reply-To: "[hidden email]" <[hidden email]>
Date: Monday, March 12, 2018 at 8:36 PM
To: "[hidden email]" <[hidden email]>
Subject: RE: Royale Build Issue

https://www.dropbox.com/s/gv9wcvixr9mkcv9/error%20executing%20ant.png?dl=0

Even after downloading this file apache-flex-sdk-pixel-bender-1.0.0-bin.zip into the "in" folder.  

 

Thanks ,

Alina

 

From: Alex Harui [[hidden email]]
Sent: Monday, March 12, 2018 9:06 PM
To: [hidden email]
Subject: Re: Royale Build Issue

 

What errors are you getting now?

 

From: Alina Kazi <[hidden email]>
Reply-To: "[hidden email]" <[hidden email]>
Date: Monday, March 12, 2018 at 2:57 AM
To: "[hidden email]" <[hidden email]>
Subject: Royale Build Issue

 

Hi Alex,

 

After windows reinstallation and copying .pbj files.

 

With configuration :

check-playerglobal-home:

     [echo] PLAYERGLOBAL_HOME is D:\playerglobal\player

     [echo] playerglobal.version is 11.1

     [echo] playerglobal.swc is D:\playerglobal\player/11.1/playerglobal.swc

 

check-air-home:

     [echo] AIR_HOME is D:\AdobeAIRSDK\bin

 

check-compiler-home:

     [echo] env.ROYALE_COMPILER_REPO is ${env.ROYALE_COMPILER_REPO}

     [echo] ROYALE_COMPILER_REPO is ${ROYALE_COMPILER_REPO}

     [echo] ROYALE_COMPILER_REPO is d:\Apache\royale-asjs/../royale-compiler

 

check-compile-env:

     [echo] OS: Windows 7 / 6.1 / amd64

     [echo] VM: Java HotSpot(TM) 64-Bit Server VM / 25.31-b07

     [echo] Java: 1.8.0_31

     [echo] Ant: Apache Ant(TM) version 1.10.2 compiled on February 3 2018 Ant Java Version: 1.8

 

And environment variable path:

PATH=C:\Windows\system32;C:\Windows;C:\Windows\System32\Wbem;C:\Windows\System32

\WindowsPowerShell\v1.0;C:\Program Files\Java\jdk1.8.0_31\bin;D:\apache-ant-1.10.2\bin;C:\Program Files\Git\cmd;D:\apache-maven-3.5.3\bin

 

Still getting Errors.

 

Please share git , maven , ant, java version.

 

Thanks,

Alina

____________________________________________________

From: Alex Harui [[hidden email]]
Sent: Friday, March 09, 2018 12:12 PM
To: [hidden email]
Subject: Re: EMULATION

 

Hi Alina,

 

I think you've downloaded a nightly build at some point.  To workaround the pixel bender problem, try copying all .pbj files from the nightly to the same folders in royale-asjs.

 

HTH,

-Alex

 

From: Alina Kazi <[hidden email]>
Reply-To: "[hidden email]" <[hidden email]>
Date: Thursday, March 8, 2018 at 10:42 PM
To: "[hidden email]" <[hidden email]>
Subject: RE: EMULATION

 

Hi Alex,

I am using Apache Ant(TM) version 1.10.1 compiled on February 2 2017 Ant Java Version: 1.8

After Downloading file manually still issue is not resolved.

 

I am reinstalling the operating system Again.

 

Thanks,

Alina

 

From: Alex Harui [[hidden email]]
Sent: Friday, March 09, 2018 10:55 AM
To: [hidden email]
Subject: Re: EMULATION

 

Hi Alina,

 

I'm not sure why you are having problems with the downloads.  Could be your distance from the actual servers or some issue with Ant.  What version of Ant are you running?

 

The mirror.json part is just trying to download this file apache-flex-sdk-pixel-bender-1.0.0-bin.zip into the "in" folder.  Try doing that manually and see if the build goes past that point.

 

Thanks,

-Alex

 

From: Alina Kazi <[hidden email]>
Reply-To: "[hidden email]" <[hidden email]>
Date: Thursday, March 8, 2018 at 9:28 PM
To: "[hidden email]" <[hidden email]>
Subject: RE: EMULATION

 

Hi Alex,

 

 

Fetched all(3) folders from git 2 days earlier , while executing “ant all” or “ant” or “maven …..” Some Errors are occurred.

During the execution of ant all , Auto download wasn’t working So,Downloaded many files manually as the url was present right before the error every time and copying file to folder path that is also mention .

Now getting Error in mirror.json downloading.

https://www.dropbox.com/s/gv9wcvixr9mkcv9/error%20executing%20ant.png?dl=0

 

Thanks,

Alina

 

Reply | Threaded
Open this post in threaded view
|

RE: Royale Build Issue

alina kazi-2

Hi Alex,

I followed all of your instructions:

https://www.dropbox.com/s/06jti95che7vu4o/pdj%20files%20added.png?dl=0

To verify that I  have copied the .pbj files correctly:

 

dir /s *.pbj

 

https://www.dropbox.com/s/idxdfm5xxm4bb64/pdjfiles.png?dl=0

 

 

If you would like to access my machine. I will share my teamviewer id and password.

 

Thanks,

Alina

 

 

From: Alex Harui [mailto:[hidden email]]
Sent: Tuesday, March 13, 2018 10:13 AM
To: [hidden email]
Subject: Re: Royale Build Issue

 

Hi Alina,

 

As I mentioned a couple of posts ago, it is better to copy the .pbj files.  Having the zip in the "in" folder won't prevent the script from trying to download pixel bender.

 

To verify that you have copied the .pbj files correctly, in Windows command prompt do:

 

dir /s *.pbj

 

There should be a set of .pbj files in frameworks/projects/Graphics/src/main/royale/org/apache/royale/graphics/utils/shaderClasses/

 

HTH,

-Alex

 

From: Alina Kazi <[hidden email]>
Reply-To: "[hidden email]" <[hidden email]>
Date: Monday, March 12, 2018 at 8:36 PM
To: "[hidden email]" <[hidden email]>
Subject: RE: Royale Build Issue

 

https://www.dropbox.com/s/gv9wcvixr9mkcv9/error%20executing%20ant.png?dl=0

Even after downloading this file apache-flex-sdk-pixel-bender-1.0.0-bin.zip into the "in" folder.  

 

Thanks ,

Alina

 

From: Alex Harui [[hidden email]]
Sent: Monday, March 12, 2018 9:06 PM
To: [hidden email]
Subject: Re: Royale Build Issue

 

What errors are you getting now?

 

From: Alina Kazi <[hidden email]>
Reply-To: "[hidden email]" <[hidden email]>
Date: Monday, March 12, 2018 at 2:57 AM
To: "[hidden email]" <[hidden email]>
Subject: Royale Build Issue

 

Hi Alex,

 

After windows reinstallation and copying .pbj files.

 

With configuration :

check-playerglobal-home:

     [echo] PLAYERGLOBAL_HOME is D:\playerglobal\player

     [echo] playerglobal.version is 11.1

     [echo] playerglobal.swc is D:\playerglobal\player/11.1/playerglobal.swc

 

check-air-home:

     [echo] AIR_HOME is D:\AdobeAIRSDK\bin

 

check-compiler-home:

     [echo] env.ROYALE_COMPILER_REPO is ${env.ROYALE_COMPILER_REPO}

     [echo] ROYALE_COMPILER_REPO is ${ROYALE_COMPILER_REPO}

     [echo] ROYALE_COMPILER_REPO is d:\Apache\royale-asjs/../royale-compiler

 

check-compile-env:

     [echo] OS: Windows 7 / 6.1 / amd64

     [echo] VM: Java HotSpot(TM) 64-Bit Server VM / 25.31-b07

     [echo] Java: 1.8.0_31

     [echo] Ant: Apache Ant(TM) version 1.10.2 compiled on February 3 2018 Ant Java Version: 1.8

 

And environment variable path:

PATH=C:\Windows\system32;C:\Windows;C:\Windows\System32\Wbem;C:\Windows\System32

\WindowsPowerShell\v1.0;C:\Program Files\Java\jdk1.8.0_31\bin;D:\apache-ant-1.10.2\bin;C:\Program Files\Git\cmd;D:\apache-maven-3.5.3\bin

 

Still getting Errors.

 

Please share git , maven , ant, java version.

 

Thanks,

Alina

____________________________________________________

From: Alex Harui [[hidden email]]
Sent: Friday, March 09, 2018 12:12 PM
To: [hidden email]
Subject: Re: EMULATION

 

Hi Alina,

 

I think you've downloaded a nightly build at some point.  To workaround the pixel bender problem, try copying all .pbj files from the nightly to the same folders in royale-asjs.

 

HTH,

-Alex

 

From: Alina Kazi <[hidden email]>
Reply-To: "[hidden email]" <[hidden email]>
Date: Thursday, March 8, 2018 at 10:42 PM
To: "[hidden email]" <[hidden email]>
Subject: RE: EMULATION

 

Hi Alex,

I am using Apache Ant(TM) version 1.10.1 compiled on February 2 2017 Ant Java Version: 1.8

After Downloading file manually still issue is not resolved.

 

I am reinstalling the operating system Again.

 

Thanks,

Alina

 

From: Alex Harui [[hidden email]]
Sent: Friday, March 09, 2018 10:55 AM
To: [hidden email]
Subject: Re: EMULATION

 

Hi Alina,

 

I'm not sure why you are having problems with the downloads.  Could be your distance from the actual servers or some issue with Ant.  What version of Ant are you running?

 

The mirror.json part is just trying to download this file apache-flex-sdk-pixel-bender-1.0.0-bin.zip into the "in" folder.  Try doing that manually and see if the build goes past that point.

 

Thanks,

-Alex

 

From: Alina Kazi <[hidden email]>
Reply-To: "[hidden email]" <[hidden email]>
Date: Thursday, March 8, 2018 at 9:28 PM
To: "[hidden email]" <[hidden email]>
Subject: RE: EMULATION

 

Hi Alex,

 

 

Fetched all(3) folders from git 2 days earlier , while executing “ant all” or “ant” or “maven …..” Some Errors are occurred.

During the execution of ant all , Auto download wasn’t working So,Downloaded many files manually as the url was present right before the error every time and copying file to folder path that is also mention .

Now getting Error in mirror.json downloading.

https://www.dropbox.com/s/gv9wcvixr9mkcv9/error%20executing%20ant.png?dl=0

 

Thanks,

Alina

 

Reply | Threaded
Open this post in threaded view
|

Re: Royale Build Issue

Alex Harui-2
Hi Alina,

I can't see the full set of folders in the first dropbox link.

In the second, it appears to be listing of d:\prev\prev\royale-asjs

However, the console output you posted two posts ago indicates you are running ant in D:\apache royale develop\royale-asjs

Please make sure that you are copying .pbj files to the right folders.  I would recommend using folder names without spaces just in case.

HTH,
-Alex

From: Alina Kazi <[hidden email]>
Reply-To: "[hidden email]" <[hidden email]>
Date: Monday, March 12, 2018 at 9:32 PM
To: "[hidden email]" <[hidden email]>
Subject: RE: Royale Build Issue

Hi Alex,

I followed all of your instructions:

https://www.dropbox.com/s/06jti95che7vu4o/pdj%20files%20added.png?dl=0

To verify that I  have copied the .pbj files correctly:

 

dir /s *.pbj

 

https://www.dropbox.com/s/idxdfm5xxm4bb64/pdjfiles.png?dl=0

 

 

If you would like to access my machine. I will share my teamviewer id and password.

 

Thanks,

Alina

 

 

From: Alex Harui [[hidden email]]
Sent: Tuesday, March 13, 2018 10:13 AM
To: [hidden email]
Subject: Re: Royale Build Issue

 

Hi Alina,

 

As I mentioned a couple of posts ago, it is better to copy the .pbj files.  Having the zip in the "in" folder won't prevent the script from trying to download pixel bender.

 

To verify that you have copied the .pbj files correctly, in Windows command prompt do:

 

dir /s *.pbj

 

There should be a set of .pbj files in frameworks/projects/Graphics/src/main/royale/org/apache/royale/graphics/utils/shaderClasses/

 

HTH,

-Alex

 

From: Alina Kazi <[hidden email]>
Reply-To: "[hidden email]" <[hidden email]>
Date: Monday, March 12, 2018 at 8:36 PM
To: "[hidden email]" <[hidden email]>
Subject: RE: Royale Build Issue

 

https://www.dropbox.com/s/gv9wcvixr9mkcv9/error%20executing%20ant.png?dl=0

Even after downloading this file apache-flex-sdk-pixel-bender-1.0.0-bin.zip into the "in" folder.  

 

Thanks ,

Alina

 

From: Alex Harui [[hidden email]]
Sent: Monday, March 12, 2018 9:06 PM
To: [hidden email]
Subject: Re: Royale Build Issue

 

What errors are you getting now?

 

From: Alina Kazi <[hidden email]>
Reply-To: "[hidden email]" <[hidden email]>
Date: Monday, March 12, 2018 at 2:57 AM
To: "[hidden email]" <[hidden email]>
Subject: Royale Build Issue

 

Hi Alex,

 

After windows reinstallation and copying .pbj files.

 

With configuration :

check-playerglobal-home:

     [echo] PLAYERGLOBAL_HOME is D:\playerglobal\player

     [echo] playerglobal.version is 11.1

     [echo] playerglobal.swc is D:\playerglobal\player/11.1/playerglobal.swc

 

check-air-home:

     [echo] AIR_HOME is D:\AdobeAIRSDK\bin

 

check-compiler-home:

     [echo] env.ROYALE_COMPILER_REPO is ${env.ROYALE_COMPILER_REPO}

     [echo] ROYALE_COMPILER_REPO is ${ROYALE_COMPILER_REPO}

     [echo] ROYALE_COMPILER_REPO is d:\Apache\royale-asjs/../royale-compiler

 

check-compile-env:

     [echo] OS: Windows 7 / 6.1 / amd64

     [echo] VM: Java HotSpot(TM) 64-Bit Server VM / 25.31-b07

     [echo] Java: 1.8.0_31

     [echo] Ant: Apache Ant(TM) version 1.10.2 compiled on February 3 2018 Ant Java Version: 1.8

 

And environment variable path:

PATH=C:\Windows\system32;C:\Windows;C:\Windows\System32\Wbem;C:\Windows\System32

\WindowsPowerShell\v1.0;C:\Program Files\Java\jdk1.8.0_31\bin;D:\apache-ant-1.10.2\bin;C:\Program Files\Git\cmd;D:\apache-maven-3.5.3\bin

 

Still getting Errors.

 

Please share git , maven , ant, java version.

 

Thanks,

Alina

____________________________________________________

From: Alex Harui [[hidden email]]
Sent: Friday, March 09, 2018 12:12 PM
To: [hidden email]
Subject: Re: EMULATION

 

Hi Alina,

 

I think you've downloaded a nightly build at some point.  To workaround the pixel bender problem, try copying all .pbj files from the nightly to the same folders in royale-asjs.

 

HTH,

-Alex

 

From: Alina Kazi <[hidden email]>
Reply-To: "[hidden email]" <[hidden email]>
Date: Thursday, March 8, 2018 at 10:42 PM
To: "[hidden email]" <[hidden email]>
Subject: RE: EMULATION

 

Hi Alex,

I am using Apache Ant(TM) version 1.10.1 compiled on February 2 2017 Ant Java Version: 1.8

After Downloading file manually still issue is not resolved.

 

I am reinstalling the operating system Again.

 

Thanks,

Alina

 

From: Alex Harui [[hidden email]]
Sent: Friday, March 09, 2018 10:55 AM
To: [hidden email]
Subject: Re: EMULATION

 

Hi Alina,

 

I'm not sure why you are having problems with the downloads.  Could be your distance from the actual servers or some issue with Ant.  What version of Ant are you running?

 

The mirror.json part is just trying to download this file apache-flex-sdk-pixel-bender-1.0.0-bin.zip into the "in" folder.  Try doing that manually and see if the build goes past that point.

 

Thanks,

-Alex

 

From: Alina Kazi <[hidden email]>
Reply-To: "[hidden email]" <[hidden email]>
Date: Thursday, March 8, 2018 at 9:28 PM
To: "[hidden email]" <[hidden email]>
Subject: RE: EMULATION

 

Hi Alex,

 

 

Fetched all(3) folders from git 2 days earlier , while executing “ant all” or “ant” or “maven …..” Some Errors are occurred.

During the execution of ant all , Auto download wasn’t working So,Downloaded many files manually as the url was present right before the error every time and copying file to folder path that is also mention .

Now getting Error in mirror.json downloading.

https://www.dropbox.com/s/gv9wcvixr9mkcv9/error%20executing%20ant.png?dl=0

 

Thanks,

Alina

 

Reply | Threaded
Open this post in threaded view
|

RE: Royale Build Issue

alina kazi-2

Hi Alex,

D:\apache royale develop\royale-asjs

D:\apache\ royale-asjs

d:\prev\prev\royale-asjs

all are the folders that I tried on different time currently I have only one of them that is d:\prev\prev\royale-asjs

and I copied all .pbj files into d:\prev\prev\royale-asjs \frameworks/projects/Graphics/src/main/royale/org/apache/royale/graphics/utils/shaderClasses/

 

 

From: Alex Harui [mailto:[hidden email]]
Sent: Tuesday, March 13, 2018 11:13 AM
To: [hidden email]
Subject: Re: Royale Build Issue

 

Hi Alina,

 

I can't see the full set of folders in the first dropbox link.

 

In the second, it appears to be listing of d:\prev\prev\royale-asjs

 

However, the console output you posted two posts ago indicates you are running ant in D:\apache royale develop\royale-asjs

 

Please make sure that you are copying .pbj files to the right folders.  I would recommend using folder names without spaces just in case.

 

HTH,

-Alex

 

From: Alina Kazi <[hidden email]>
Reply-To: "[hidden email]" <[hidden email]>
Date: Monday, March 12, 2018 at 9:32 PM
To: "[hidden email]" <[hidden email]>
Subject: RE: Royale Build Issue

 

Hi Alex,

I followed all of your instructions:

https://www.dropbox.com/s/06jti95che7vu4o/pdj%20files%20added.png?dl=0

To verify that I  have copied the .pbj files correctly:

 

dir /s *.pbj

 

https://www.dropbox.com/s/idxdfm5xxm4bb64/pdjfiles.png?dl=0

 

 

If you would like to access my machine. I will share my teamviewer id and password.

 

Thanks,

Alina

 

 

From: Alex Harui [[hidden email]]
Sent: Tuesday, March 13, 2018 10:13 AM
To: [hidden email]
Subject: Re: Royale Build Issue

 

Hi Alina,

 

As I mentioned a couple of posts ago, it is better to copy the .pbj files.  Having the zip in the "in" folder won't prevent the script from trying to download pixel bender.

 

To verify that you have copied the .pbj files correctly, in Windows command prompt do:

 

dir /s *.pbj

 

There should be a set of .pbj files in frameworks/projects/Graphics/src/main/royale/org/apache/royale/graphics/utils/shaderClasses/

 

HTH,

-Alex

 

From: Alina Kazi <[hidden email]>
Reply-To: "[hidden email]" <[hidden email]>
Date: Monday, March 12, 2018 at 8:36 PM
To: "[hidden email]" <[hidden email]>
Subject: RE: Royale Build Issue

 

https://www.dropbox.com/s/gv9wcvixr9mkcv9/error%20executing%20ant.png?dl=0

Even after downloading this file apache-flex-sdk-pixel-bender-1.0.0-bin.zip into the "in" folder.  

 

Thanks ,

Alina

 

From: Alex Harui [[hidden email]]
Sent: Monday, March 12, 2018 9:06 PM
To: [hidden email]
Subject: Re: Royale Build Issue

 

What errors are you getting now?

 

From: Alina Kazi <[hidden email]>
Reply-To: "[hidden email]" <[hidden email]>
Date: Monday, March 12, 2018 at 2:57 AM
To: "[hidden email]" <[hidden email]>
Subject: Royale Build Issue

 

Hi Alex,

 

After windows reinstallation and copying .pbj files.

 

With configuration :

check-playerglobal-home:

     [echo] PLAYERGLOBAL_HOME is D:\playerglobal\player

     [echo] playerglobal.version is 11.1

     [echo] playerglobal.swc is D:\playerglobal\player/11.1/playerglobal.swc

 

check-air-home:

     [echo] AIR_HOME is D:\AdobeAIRSDK\bin

 

check-compiler-home:

     [echo] env.ROYALE_COMPILER_REPO is ${env.ROYALE_COMPILER_REPO}

     [echo] ROYALE_COMPILER_REPO is ${ROYALE_COMPILER_REPO}

     [echo] ROYALE_COMPILER_REPO is d:\Apache\royale-asjs/../royale-compiler

 

check-compile-env:

     [echo] OS: Windows 7 / 6.1 / amd64

     [echo] VM: Java HotSpot(TM) 64-Bit Server VM / 25.31-b07

     [echo] Java: 1.8.0_31

     [echo] Ant: Apache Ant(TM) version 1.10.2 compiled on February 3 2018 Ant Java Version: 1.8

 

And environment variable path:

PATH=C:\Windows\system32;C:\Windows;C:\Windows\System32\Wbem;C:\Windows\System32

\WindowsPowerShell\v1.0;C:\Program Files\Java\jdk1.8.0_31\bin;D:\apache-ant-1.10.2\bin;C:\Program Files\Git\cmd;D:\apache-maven-3.5.3\bin

 

Still getting Errors.

 

Please share git , maven , ant, java version.

 

Thanks,

Alina

____________________________________________________

From: Alex Harui [[hidden email]]
Sent: Friday, March 09, 2018 12:12 PM
To: [hidden email]
Subject: Re: EMULATION

 

Hi Alina,

 

I think you've downloaded a nightly build at some point.  To workaround the pixel bender problem, try copying all .pbj files from the nightly to the same folders in royale-asjs.

 

HTH,

-Alex

 

From: Alina Kazi <[hidden email]>
Reply-To: "[hidden email]" <[hidden email]>
Date: Thursday, March 8, 2018 at 10:42 PM
To: "[hidden email]" <[hidden email]>
Subject: RE: EMULATION

 

Hi Alex,

I am using Apache Ant(TM) version 1.10.1 compiled on February 2 2017 Ant Java Version: 1.8

After Downloading file manually still issue is not resolved.

 

I am reinstalling the operating system Again.

 

Thanks,

Alina

 

From: Alex Harui [[hidden email]]
Sent: Friday, March 09, 2018 10:55 AM
To: [hidden email]
Subject: Re: EMULATION

 

Hi Alina,

 

I'm not sure why you are having problems with the downloads.  Could be your distance from the actual servers or some issue with Ant.  What version of Ant are you running?

 

The mirror.json part is just trying to download this file apache-flex-sdk-pixel-bender-1.0.0-bin.zip into the "in" folder.  Try doing that manually and see if the build goes past that point.

 

Thanks,

-Alex

 

From: Alina Kazi <[hidden email]>
Reply-To: "[hidden email]" <[hidden email]>
Date: Thursday, March 8, 2018 at 9:28 PM
To: "[hidden email]" <[hidden email]>
Subject: RE: EMULATION

 

Hi Alex,

 

 

Fetched all(3) folders from git 2 days earlier , while executing “ant all” or “ant” or “maven …..” Some Errors are occurred.

During the execution of ant all , Auto download wasn’t working So,Downloaded many files manually as the url was present right before the error every time and copying file to folder path that is also mention .

Now getting Error in mirror.json downloading.

https://www.dropbox.com/s/gv9wcvixr9mkcv9/error%20executing%20ant.png?dl=0

 

Thanks,

Alina

 

Reply | Threaded
Open this post in threaded view
|

Re: Royale Build Issue

Alex Harui-2
Hi Alina,

Please only use d:\prev\prev\royale-asjs for now.  Make sure the .pbj files haven't been erased somehow and run ant again and post the console output.

Thanks,
-Alex

From: Alina Kazi <[hidden email]>
Reply-To: "[hidden email]" <[hidden email]>
Date: Monday, March 12, 2018 at 10:07 PM
To: "[hidden email]" <[hidden email]>
Subject: RE: Royale Build Issue

Hi Alex,

D:\apache royale develop\royale-asjs

D:\apache\ royale-asjs

d:\prev\prev\royale-asjs

all are the folders that I tried on different time currently I have only one of them that is d:\prev\prev\royale-asjs

and I copied all .pbj files into d:\prev\prev\royale-asjs \frameworks/projects/Graphics/src/main/royale/org/apache/royale/graphics/utils/shaderClasses/

 

 

From: Alex Harui [[hidden email]]
Sent: Tuesday, March 13, 2018 11:13 AM
To: [hidden email]
Subject: Re: Royale Build Issue

 

Hi Alina,

 

I can't see the full set of folders in the first dropbox link.

 

In the second, it appears to be listing of d:\prev\prev\royale-asjs

 

However, the console output you posted two posts ago indicates you are running ant in D:\apache royale develop\royale-asjs

 

Please make sure that you are copying .pbj files to the right folders.  I would recommend using folder names without spaces just in case.

 

HTH,

-Alex

 

From: Alina Kazi <[hidden email]>
Reply-To: "[hidden email]" <[hidden email]>
Date: Monday, March 12, 2018 at 9:32 PM
To: "[hidden email]" <[hidden email]>
Subject: RE: Royale Build Issue

 

Hi Alex,

I followed all of your instructions:

https://www.dropbox.com/s/06jti95che7vu4o/pdj%20files%20added.png?dl=0

To verify that I  have copied the .pbj files correctly:

 

dir /s *.pbj

 

https://www.dropbox.com/s/idxdfm5xxm4bb64/pdjfiles.png?dl=0

 

 

If you would like to access my machine. I will share my teamviewer id and password.

 

Thanks,

Alina

 

 

From: Alex Harui [[hidden email]]
Sent: Tuesday, March 13, 2018 10:13 AM
To: [hidden email]
Subject: Re: Royale Build Issue

 

Hi Alina,

 

As I mentioned a couple of posts ago, it is better to copy the .pbj files.  Having the zip in the "in" folder won't prevent the script from trying to download pixel bender.

 

To verify that you have copied the .pbj files correctly, in Windows command prompt do:

 

dir /s *.pbj

 

There should be a set of .pbj files in frameworks/projects/Graphics/src/main/royale/org/apache/royale/graphics/utils/shaderClasses/

 

HTH,

-Alex

 

From: Alina Kazi <[hidden email]>
Reply-To: "[hidden email]" <[hidden email]>
Date: Monday, March 12, 2018 at 8:36 PM
To: "[hidden email]" <[hidden email]>
Subject: RE: Royale Build Issue

 

https://www.dropbox.com/s/gv9wcvixr9mkcv9/error%20executing%20ant.png?dl=0

Even after downloading this file apache-flex-sdk-pixel-bender-1.0.0-bin.zip into the "in" folder.  

 

Thanks ,

Alina

 

From: Alex Harui [[hidden email]]
Sent: Monday, March 12, 2018 9:06 PM
To: [hidden email]
Subject: Re: Royale Build Issue

 

What errors are you getting now?

 

From: Alina Kazi <[hidden email]>
Reply-To: "[hidden email]" <[hidden email]>
Date: Monday, March 12, 2018 at 2:57 AM
To: "[hidden email]" <[hidden email]>
Subject: Royale Build Issue

 

Hi Alex,

 

After windows reinstallation and copying .pbj files.

 

With configuration :

check-playerglobal-home:

     [echo] PLAYERGLOBAL_HOME is D:\playerglobal\player

     [echo] playerglobal.version is 11.1

     [echo] playerglobal.swc is D:\playerglobal\player/11.1/playerglobal.swc

 

check-air-home:

     [echo] AIR_HOME is D:\AdobeAIRSDK\bin

 

check-compiler-home:

     [echo] env.ROYALE_COMPILER_REPO is ${env.ROYALE_COMPILER_REPO}

     [echo] ROYALE_COMPILER_REPO is ${ROYALE_COMPILER_REPO}

     [echo] ROYALE_COMPILER_REPO is d:\Apache\royale-asjs/../royale-compiler

 

check-compile-env:

     [echo] OS: Windows 7 / 6.1 / amd64

     [echo] VM: Java HotSpot(TM) 64-Bit Server VM / 25.31-b07

     [echo] Java: 1.8.0_31

     [echo] Ant: Apache Ant(TM) version 1.10.2 compiled on February 3 2018 Ant Java Version: 1.8

 

And environment variable path:

PATH=C:\Windows\system32;C:\Windows;C:\Windows\System32\Wbem;C:\Windows\System32

\WindowsPowerShell\v1.0;C:\Program Files\Java\jdk1.8.0_31\bin;D:\apache-ant-1.10.2\bin;C:\Program Files\Git\cmd;D:\apache-maven-3.5.3\bin

 

Still getting Errors.

 

Please share git , maven , ant, java version.

 

Thanks,

Alina

____________________________________________________

From: Alex Harui [[hidden email]]
Sent: Friday, March 09, 2018 12:12 PM
To: [hidden email]
Subject: Re: EMULATION

 

Hi Alina,

 

I think you've downloaded a nightly build at some point.  To workaround the pixel bender problem, try copying all .pbj files from the nightly to the same folders in royale-asjs.

 

HTH,

-Alex

 

From: Alina Kazi <[hidden email]>
Reply-To: "[hidden email]" <[hidden email]>
Date: Thursday, March 8, 2018 at 10:42 PM
To: "[hidden email]" <[hidden email]>
Subject: RE: EMULATION

 

Hi Alex,

I am using Apache Ant(TM) version 1.10.1 compiled on February 2 2017 Ant Java Version: 1.8

After Downloading file manually still issue is not resolved.

 

I am reinstalling the operating system Again.

 

Thanks,

Alina

 

From: Alex Harui [[hidden email]]
Sent: Friday, March 09, 2018 10:55 AM
To: [hidden email]
Subject: Re: EMULATION

 

Hi Alina,

 

I'm not sure why you are having problems with the downloads.  Could be your distance from the actual servers or some issue with Ant.  What version of Ant are you running?

 

The mirror.json part is just trying to download this file apache-flex-sdk-pixel-bender-1.0.0-bin.zip into the "in" folder.  Try doing that manually and see if the build goes past that point.

 

Thanks,

-Alex

 

From: Alina Kazi <[hidden email]>
Reply-To: "[hidden email]" <[hidden email]>
Date: Thursday, March 8, 2018 at 9:28 PM
To: "[hidden email]" <[hidden email]>
Subject: RE: EMULATION

 

Hi Alex,

 

 

Fetched all(3) folders from git 2 days earlier , while executing “ant all” or “ant” or “maven …..” Some Errors are occurred.

During the execution of ant all , Auto download wasn’t working So,Downloaded many files manually as the url was present right before the error every time and copying file to folder path that is also mention .

Now getting Error in mirror.json downloading.

https://www.dropbox.com/s/gv9wcvixr9mkcv9/error%20executing%20ant.png?dl=0

 

Thanks,

Alina

 

Reply | Threaded
Open this post in threaded view
|

RE: Royale Build Issue

alina kazi-2

Hi Alex,

 

.pbj files aren’t erased .

Console Output:

https://www.dropbox.com/s/wq3qxdrpdywb25i/error%20ant.txt?dl=0

 

Can you please share all folders in Zip with all dependencies downloaded at my address: [hidden email]

 

 

Thanks,

Alina

 

 

From: Alex Harui [mailto:[hidden email]]
Sent: Tuesday, March 13, 2018 11:55 AM
To: [hidden email]
Subject: Re: Royale Build Issue

 

Hi Alina,

 

Please only use d:\prev\prev\royale-asjs for now.  Make sure the .pbj files haven't been erased somehow and run ant again and post the console output.

 

Thanks,

-Alex

 

From: Alina Kazi <[hidden email]>
Reply-To: "[hidden email]" <[hidden email]>
Date: Monday, March 12, 2018 at 10:07 PM
To: "[hidden email]" <[hidden email]>
Subject: RE: Royale Build Issue

 

Hi Alex,

D:\apache royale develop\royale-asjs

D:\apache\ royale-asjs

d:\prev\prev\royale-asjs

all are the folders that I tried on different time currently I have only one of them that is d:\prev\prev\royale-asjs

and I copied all .pbj files into d:\prev\prev\royale-asjs \frameworks/projects/Graphics/src/main/royale/org/apache/royale/graphics/utils/shaderClasses/

 

 

From: Alex Harui [[hidden email]]
Sent: Tuesday, March 13, 2018 11:13 AM
To: [hidden email]
Subject: Re: Royale Build Issue

 

Hi Alina,

 

I can't see the full set of folders in the first dropbox link.

 

In the second, it appears to be listing of d:\prev\prev\royale-asjs

 

However, the console output you posted two posts ago indicates you are running ant in D:\apache royale develop\royale-asjs

 

Please make sure that you are copying .pbj files to the right folders.  I would recommend using folder names without spaces just in case.

 

HTH,

-Alex

 

From: Alina Kazi <[hidden email]>
Reply-To: "[hidden email]" <[hidden email]>
Date: Monday, March 12, 2018 at 9:32 PM
To: "[hidden email]" <[hidden email]>
Subject: RE: Royale Build Issue

 

Hi Alex,

I followed all of your instructions:

https://www.dropbox.com/s/06jti95che7vu4o/pdj%20files%20added.png?dl=0

To verify that I  have copied the .pbj files correctly:

 

dir /s *.pbj

 

https://www.dropbox.com/s/idxdfm5xxm4bb64/pdjfiles.png?dl=0

 

 

If you would like to access my machine. I will share my teamviewer id and password.

 

Thanks,

Alina

 

 

From: Alex Harui [[hidden email]]
Sent: Tuesday, March 13, 2018 10:13 AM
To: [hidden email]
Subject: Re: Royale Build Issue

 

Hi Alina,

 

As I mentioned a couple of posts ago, it is better to copy the .pbj files.  Having the zip in the "in" folder won't prevent the script from trying to download pixel bender.

 

To verify that you have copied the .pbj files correctly, in Windows command prompt do:

 

dir /s *.pbj

 

There should be a set of .pbj files in frameworks/projects/Graphics/src/main/royale/org/apache/royale/graphics/utils/shaderClasses/

 

HTH,

-Alex

 

From: Alina Kazi <[hidden email]>
Reply-To: "[hidden email]" <[hidden email]>
Date: Monday, March 12, 2018 at 8:36 PM
To: "[hidden email]" <[hidden email]>
Subject: RE: Royale Build Issue

 

https://www.dropbox.com/s/gv9wcvixr9mkcv9/error%20executing%20ant.png?dl=0

Even after downloading this file apache-flex-sdk-pixel-bender-1.0.0-bin.zip into the "in" folder.  

 

Thanks ,

Alina

 

From: Alex Harui [[hidden email]]
Sent: Monday, March 12, 2018 9:06 PM
To: [hidden email]
Subject: Re: Royale Build Issue

 

What errors are you getting now?

 

From: Alina Kazi <[hidden email]>
Reply-To: "[hidden email]" <[hidden email]>
Date: Monday, March 12, 2018 at 2:57 AM
To: "[hidden email]" <[hidden email]>
Subject: Royale Build Issue

 

Hi Alex,

 

After windows reinstallation and copying .pbj files.

 

With configuration :

check-playerglobal-home:

     [echo] PLAYERGLOBAL_HOME is D:\playerglobal\player

     [echo] playerglobal.version is 11.1

     [echo] playerglobal.swc is D:\playerglobal\player/11.1/playerglobal.swc

 

check-air-home:

     [echo] AIR_HOME is D:\AdobeAIRSDK\bin

 

check-compiler-home:

     [echo] env.ROYALE_COMPILER_REPO is ${env.ROYALE_COMPILER_REPO}

     [echo] ROYALE_COMPILER_REPO is ${ROYALE_COMPILER_REPO}

     [echo] ROYALE_COMPILER_REPO is d:\Apache\royale-asjs/../royale-compiler

 

check-compile-env:

     [echo] OS: Windows 7 / 6.1 / amd64

     [echo] VM: Java HotSpot(TM) 64-Bit Server VM / 25.31-b07

     [echo] Java: 1.8.0_31

     [echo] Ant: Apache Ant(TM) version 1.10.2 compiled on February 3 2018 Ant Java Version: 1.8

 

And environment variable path:

PATH=C:\Windows\system32;C:\Windows;C:\Windows\System32\Wbem;C:\Windows\System32

\WindowsPowerShell\v1.0;C:\Program Files\Java\jdk1.8.0_31\bin;D:\apache-ant-1.10.2\bin;C:\Program Files\Git\cmd;D:\apache-maven-3.5.3\bin

 

Still getting Errors.

 

Please share git , maven , ant, java version.

 

Thanks,

Alina

____________________________________________________

From: Alex Harui [[hidden email]]
Sent: Friday, March 09, 2018 12:12 PM
To: [hidden email]
Subject: Re: EMULATION

 

Hi Alina,

 

I think you've downloaded a nightly build at some point.  To workaround the pixel bender problem, try copying all .pbj files from the nightly to the same folders in royale-asjs.

 

HTH,

-Alex

 

From: Alina Kazi <[hidden email]>
Reply-To: "[hidden email]" <[hidden email]>
Date: Thursday, March 8, 2018 at 10:42 PM
To: "[hidden email]" <[hidden email]>
Subject: RE: EMULATION

 

Hi Alex,

I am using Apache Ant(TM) version 1.10.1 compiled on February 2 2017 Ant Java Version: 1.8

After Downloading file manually still issue is not resolved.

 

I am reinstalling the operating system Again.

 

Thanks,

Alina

 

From: Alex Harui [[hidden email]]
Sent: Friday, March 09, 2018 10:55 AM
To: [hidden email]
Subject: Re: EMULATION

 

Hi Alina,

 

I'm not sure why you are having problems with the downloads.  Could be your distance from the actual servers or some issue with Ant.  What version of Ant are you running?

 

The mirror.json part is just trying to download this file apache-flex-sdk-pixel-bender-1.0.0-bin.zip into the "in" folder.  Try doing that manually and see if the build goes past that point.

 

Thanks,

-Alex

 

From: Alina Kazi <[hidden email]>
Reply-To: "[hidden email]" <[hidden email]>
Date: Thursday, March 8, 2018 at 9:28 PM
To: "[hidden email]" <[hidden email]>
Subject: RE: EMULATION

 

Hi Alex,

 

 

Fetched all(3) folders from git 2 days earlier , while executing “ant all” or “ant” or “maven …..” Some Errors are occurred.

During the execution of ant all , Auto download wasn’t working So,Downloaded many files manually as the url was present right before the error every time and copying file to folder path that is also mention .

Now getting Error in mirror.json downloading.

https://www.dropbox.com/s/gv9wcvixr9mkcv9/error%20executing%20ant.png?dl=0

 

Thanks,

Alina

 

Reply | Threaded
Open this post in threaded view
|

Re: Royale Build Issue

Alex Harui-2
Hi Alina,

This output says you are now failing on flexunit, not pixelbender.

Try downloading manually: http://www.apache.org/dyn/mirrors/mirrors.cgi/flex/flexunit/4.2.0/binaries/apache-flex-flexunit-4.2.0-4.12.0-bin.zip

Put that zip file in the "in" folder and expand it.  It should create a flexunit folder in "in" so you should have many files one of which is:

in/flexunit/flexunit/flexunit-4.2.0-20140410-flex_4.12.0.swc


HTH,
-Alex

From: Alina Kazi <[hidden email]>
Reply-To: "[hidden email]" <[hidden email]>
Date: Monday, March 12, 2018 at 11:07 PM
To: "[hidden email]" <[hidden email]>
Subject: RE: Royale Build Issue

Hi Alex,

 

.pbj files aren’t erased .

Console Output:

https://www.dropbox.com/s/wq3qxdrpdywb25i/error%20ant.txt?dl=0

 

Can you please share all folders in Zip with all dependencies downloaded at my address: [hidden email]

 

 

Thanks,

Alina

 

 

From: Alex Harui [[hidden email]]
Sent: Tuesday, March 13, 2018 11:55 AM
To: [hidden email]
Subject: Re: Royale Build Issue

 

Hi Alina,

 

Please only use d:\prev\prev\royale-asjs for now.  Make sure the .pbj files haven't been erased somehow and run ant again and post the console output.

 

Thanks,

-Alex

 

From: Alina Kazi <[hidden email]>
Reply-To: "[hidden email]" <[hidden email]>
Date: Monday, March 12, 2018 at 10:07 PM
To: "[hidden email]" <[hidden email]>
Subject: RE: Royale Build Issue

 

Hi Alex,

D:\apache royale develop\royale-asjs

D:\apache\ royale-asjs

d:\prev\prev\royale-asjs

all are the folders that I tried on different time currently I have only one of them that is d:\prev\prev\royale-asjs

and I copied all .pbj files into d:\prev\prev\royale-asjs \frameworks/projects/Graphics/src/main/royale/org/apache/royale/graphics/utils/shaderClasses/

 

 

From: Alex Harui [[hidden email]]
Sent: Tuesday, March 13, 2018 11:13 AM
To: [hidden email]
Subject: Re: Royale Build Issue

 

Hi Alina,

 

I can't see the full set of folders in the first dropbox link.

 

In the second, it appears to be listing of d:\prev\prev\royale-asjs

 

However, the console output you posted two posts ago indicates you are running ant in D:\apache royale develop\royale-asjs

 

Please make sure that you are copying .pbj files to the right folders.  I would recommend using folder names without spaces just in case.

 

HTH,

-Alex

 

From: Alina Kazi <[hidden email]>
Reply-To: "[hidden email]" <[hidden email]>
Date: Monday, March 12, 2018 at 9:32 PM
To: "[hidden email]" <[hidden email]>
Subject: RE: Royale Build Issue

 

Hi Alex,

I followed all of your instructions:

https://www.dropbox.com/s/06jti95che7vu4o/pdj%20files%20added.png?dl=0

To verify that I  have copied the .pbj files correctly:

 

dir /s *.pbj

 

https://www.dropbox.com/s/idxdfm5xxm4bb64/pdjfiles.png?dl=0

 

 

If you would like to access my machine. I will share my teamviewer id and password.

 

Thanks,

Alina

 

 

From: Alex Harui [[hidden email]]
Sent: Tuesday, March 13, 2018 10:13 AM
To: [hidden email]
Subject: Re: Royale Build Issue

 

Hi Alina,

 

As I mentioned a couple of posts ago, it is better to copy the .pbj files.  Having the zip in the "in" folder won't prevent the script from trying to download pixel bender.

 

To verify that you have copied the .pbj files correctly, in Windows command prompt do:

 

dir /s *.pbj

 

There should be a set of .pbj files in frameworks/projects/Graphics/src/main/royale/org/apache/royale/graphics/utils/shaderClasses/

 

HTH,

-Alex

 

From: Alina Kazi <[hidden email]>
Reply-To: "[hidden email]" <[hidden email]>
Date: Monday, March 12, 2018 at 8:36 PM
To: "[hidden email]" <[hidden email]>
Subject: RE: Royale Build Issue

 

https://www.dropbox.com/s/gv9wcvixr9mkcv9/error%20executing%20ant.png?dl=0

Even after downloading this file apache-flex-sdk-pixel-bender-1.0.0-bin.zip into the "in" folder.  

 

Thanks ,

Alina

 

From: Alex Harui [[hidden email]]
Sent: Monday, March 12, 2018 9:06 PM
To: [hidden email]
Subject: Re: Royale Build Issue

 

What errors are you getting now?

 

From: Alina Kazi <[hidden email]>
Reply-To: "[hidden email]" <[hidden email]>
Date: Monday, March 12, 2018 at 2:57 AM
To: "[hidden email]" <[hidden email]>
Subject: Royale Build Issue

 

Hi Alex,

 

After windows reinstallation and copying .pbj files.

 

With configuration :

check-playerglobal-home:

     [echo] PLAYERGLOBAL_HOME is D:\playerglobal\player

     [echo] playerglobal.version is 11.1

     [echo] playerglobal.swc is D:\playerglobal\player/11.1/playerglobal.swc

 

check-air-home:

     [echo] AIR_HOME is D:\AdobeAIRSDK\bin

 

check-compiler-home:

     [echo] env.ROYALE_COMPILER_REPO is ${env.ROYALE_COMPILER_REPO}

     [echo] ROYALE_COMPILER_REPO is ${ROYALE_COMPILER_REPO}

     [echo] ROYALE_COMPILER_REPO is d:\Apache\royale-asjs/../royale-compiler

 

check-compile-env:

     [echo] OS: Windows 7 / 6.1 / amd64

     [echo] VM: Java HotSpot(TM) 64-Bit Server VM / 25.31-b07

     [echo] Java: 1.8.0_31

     [echo] Ant: Apache Ant(TM) version 1.10.2 compiled on February 3 2018 Ant Java Version: 1.8

 

And environment variable path:

PATH=C:\Windows\system32;C:\Windows;C:\Windows\System32\Wbem;C:\Windows\System32

\WindowsPowerShell\v1.0;C:\Program Files\Java\jdk1.8.0_31\bin;D:\apache-ant-1.10.2\bin;C:\Program Files\Git\cmd;D:\apache-maven-3.5.3\bin

 

Still getting Errors.

 

Please share git , maven , ant, java version.

 

Thanks,

Alina

____________________________________________________

From: Alex Harui [[hidden email]]
Sent: Friday, March 09, 2018 12:12 PM
To: [hidden email]
Subject: Re: EMULATION

 

Hi Alina,

 

I think you've downloaded a nightly build at some point.  To workaround the pixel bender problem, try copying all .pbj files from the nightly to the same folders in royale-asjs.

 

HTH,

-Alex

 

From: Alina Kazi <[hidden email]>
Reply-To: "[hidden email]" <[hidden email]>
Date: Thursday, March 8, 2018 at 10:42 PM
To: "[hidden email]" <[hidden email]>
Subject: RE: EMULATION

 

Hi Alex,

I am using Apache Ant(TM) version 1.10.1 compiled on February 2 2017 Ant Java Version: 1.8

After Downloading file manually still issue is not resolved.

 

I am reinstalling the operating system Again.

 

Thanks,

Alina

 

From: Alex Harui [[hidden email]]
Sent: Friday, March 09, 2018 10:55 AM
To: [hidden email]
Subject: Re: EMULATION

 

Hi Alina,

 

I'm not sure why you are having problems with the downloads.  Could be your distance from the actual servers or some issue with Ant.  What version of Ant are you running?

 

The mirror.json part is just trying to download this file apache-flex-sdk-pixel-bender-1.0.0-bin.zip into the "in" folder.  Try doing that manually and see if the build goes past that point.

 

Thanks,

-Alex

 

From: Alina Kazi <[hidden email]>
Reply-To: "[hidden email]" <[hidden email]>
Date: Thursday, March 8, 2018 at 9:28 PM
To: "[hidden email]" <[hidden email]>
Subject: RE: EMULATION

 

Hi Alex,

 

 

Fetched all(3) folders from git 2 days earlier , while executing “ant all” or “ant” or “maven …..” Some Errors are occurred.

During the execution of ant all , Auto download wasn’t working So,Downloaded many files manually as the url was present right before the error every time and copying file to folder path that is also mention .

Now getting Error in mirror.json downloading.

https://www.dropbox.com/s/gv9wcvixr9mkcv9/error%20executing%20ant.png?dl=0

 

Thanks,

Alina

 

Reply | Threaded
Open this post in threaded view
|

RE: Royale Build Issue

alina kazi-2

Hi Alex,

Downloaded and then manually downloaded swfobject_2_2 n so on..

When this process of downloading will be completed I will inform you.

 

Reference: https://raw.githubusercontent.com/wiki/apache/royale-asjs/Building-From-Source.md

  Notes :  `ROYALE_TYPEDEFS_HOME` can be used to point the build to a `royale-typedefs` clone in some place other than the default location.

 

 

check-typedefs-home:

     [echo] ROYALE_TYPEDEFS_HOME is ${env.ROYALE_TYPEDEFS_HOME}

     [echo] basedir is D:\prev\prev\royale-asjs

 

BUILD FAILED

D:\prev\prev\royale-asjs\build.xml:321: ROYALE_TYPEDEFS_HOME must be set to a folder containing js/target/js.swc such as the royale-typedefs repo

 

 

Thank you so much.

-Alina

 

 

From: Alex Harui [mailto:[hidden email]]
Sent: Tuesday, March 13, 2018 12:29 PM
To: [hidden email]
Subject: Re: Royale Build Issue

 

Hi Alina,

 

This output says you are now failing on flexunit, not pixelbender.

 

Try downloading manually: http://www.apache.org/dyn/mirrors/mirrors.cgi/flex/flexunit/4.2.0/binaries/apache-flex-flexunit-4.2.0-4.12.0-bin.zip

 

Put that zip file in the "in" folder and expand it.  It should create a flexunit folder in "in" so you should have many files one of which is:

 

in/flexunit/flexunit/flexunit-4.2.0-20140410-flex_4.12.0.swc

 

HTH,

-Alex

 

From: Alina Kazi <[hidden email]>
Reply-To: "[hidden email]" <[hidden email]>
Date: Monday, March 12, 2018 at 11:07 PM
To: "[hidden email]" <[hidden email]>
Subject: RE: Royale Build Issue

 

Hi Alex,

 

.pbj files aren’t erased .

Console Output:

https://www.dropbox.com/s/wq3qxdrpdywb25i/error%20ant.txt?dl=0

 

Can you please share all folders in Zip with all dependencies downloaded at my address: [hidden email]

 

 

Thanks,

Alina

 

 

From: Alex Harui [[hidden email]]
Sent: Tuesday, March 13, 2018 11:55 AM
To: [hidden email]
Subject: Re: Royale Build Issue

 

Hi Alina,

 

Please only use d:\prev\prev\royale-asjs for now.  Make sure the .pbj files haven't been erased somehow and run ant again and post the console output.

 

Thanks,

-Alex

 

From: Alina Kazi <[hidden email]>
Reply-To: "[hidden email]" <[hidden email]>
Date: Monday, March 12, 2018 at 10:07 PM
To: "[hidden email]" <[hidden email]>
Subject: RE: Royale Build Issue

 

Hi Alex,

D:\apache royale develop\royale-asjs

D:\apache\ royale-asjs

d:\prev\prev\royale-asjs

all are the folders that I tried on different time currently I have only one of them that is d:\prev\prev\royale-asjs

and I copied all .pbj files into d:\prev\prev\royale-asjs \frameworks/projects/Graphics/src/main/royale/org/apache/royale/graphics/utils/shaderClasses/

 

 

From: Alex Harui [[hidden email]]
Sent: Tuesday, March 13, 2018 11:13 AM
To: [hidden email]
Subject: Re: Royale Build Issue

 

Hi Alina,

 

I can't see the full set of folders in the first dropbox link.

 

In the second, it appears to be listing of d:\prev\prev\royale-asjs

 

However, the console output you posted two posts ago indicates you are running ant in D:\apache royale develop\royale-asjs

 

Please make sure that you are copying .pbj files to the right folders.  I would recommend using folder names without spaces just in case.

 

HTH,

-Alex

 

From: Alina Kazi <[hidden email]>
Reply-To: "[hidden email]" <[hidden email]>
Date: Monday, March 12, 2018 at 9:32 PM
To: "[hidden email]" <[hidden email]>
Subject: RE: Royale Build Issue

 

Hi Alex,

I followed all of your instructions:

https://www.dropbox.com/s/06jti95che7vu4o/pdj%20files%20added.png?dl=0

To verify that I  have copied the .pbj files correctly:

 

dir /s *.pbj

 

https://www.dropbox.com/s/idxdfm5xxm4bb64/pdjfiles.png?dl=0

 

 

If you would like to access my machine. I will share my teamviewer id and password.

 

Thanks,

Alina

 

 

From: Alex Harui [[hidden email]]
Sent: Tuesday, March 13, 2018 10:13 AM
To: [hidden email]
Subject: Re: Royale Build Issue

 

Hi Alina,

 

As I mentioned a couple of posts ago, it is better to copy the .pbj files.  Having the zip in the "in" folder won't prevent the script from trying to download pixel bender.

 

To verify that you have copied the .pbj files correctly, in Windows command prompt do:

 

dir /s *.pbj

 

There should be a set of .pbj files in frameworks/projects/Graphics/src/main/royale/org/apache/royale/graphics/utils/shaderClasses/

 

HTH,

-Alex

 

From: Alina Kazi <[hidden email]>
Reply-To: "[hidden email]" <[hidden email]>
Date: Monday, March 12, 2018 at 8:36 PM
To: "[hidden email]" <[hidden email]>
Subject: RE: Royale Build Issue

 

https://www.dropbox.com/s/gv9wcvixr9mkcv9/error%20executing%20ant.png?dl=0

Even after downloading this file apache-flex-sdk-pixel-bender-1.0.0-bin.zip into the "in" folder.  

 

Thanks ,

Alina

 

From: Alex Harui [[hidden email]]
Sent: Monday, March 12, 2018 9:06 PM
To: [hidden email]
Subject: Re: Royale Build Issue

 

What errors are you getting now?

 

From: Alina Kazi <[hidden email]>
Reply-To: "[hidden email]" <[hidden email]>
Date: Monday, March 12, 2018 at 2:57 AM
To: "[hidden email]" <[hidden email]>
Subject: Royale Build Issue

 

Hi Alex,

 

After windows reinstallation and copying .pbj files.

 

With configuration :

check-playerglobal-home:

     [echo] PLAYERGLOBAL_HOME is D:\playerglobal\player

     [echo] playerglobal.version is 11.1

     [echo] playerglobal.swc is D:\playerglobal\player/11.1/playerglobal.swc

 

check-air-home:

     [echo] AIR_HOME is D:\AdobeAIRSDK\bin

 

check-compiler-home:

     [echo] env.ROYALE_COMPILER_REPO is ${env.ROYALE_COMPILER_REPO}

     [echo] ROYALE_COMPILER_REPO is ${ROYALE_COMPILER_REPO}

     [echo] ROYALE_COMPILER_REPO is d:\Apache\royale-asjs/../royale-compiler

 

check-compile-env:

     [echo] OS: Windows 7 / 6.1 / amd64

     [echo] VM: Java HotSpot(TM) 64-Bit Server VM / 25.31-b07

     [echo] Java: 1.8.0_31

     [echo] Ant: Apache Ant(TM) version 1.10.2 compiled on February 3 2018 Ant Java Version: 1.8

 

And environment variable path:

PATH=C:\Windows\system32;C:\Windows;C:\Windows\System32\Wbem;C:\Windows\System32

\WindowsPowerShell\v1.0;C:\Program Files\Java\jdk1.8.0_31\bin;D:\apache-ant-1.10.2\bin;C:\Program Files\Git\cmd;D:\apache-maven-3.5.3\bin

 

Still getting Errors.

 

Please share git , maven , ant, java version.

 

Thanks,

Alina

____________________________________________________

From: Alex Harui [[hidden email]]
Sent: Friday, March 09, 2018 12:12 PM
To: [hidden email]
Subject: Re: EMULATION

 

Hi Alina,

 

I think you've downloaded a nightly build at some point.  To workaround the pixel bender problem, try copying all .pbj files from the nightly to the same folders in royale-asjs.

 

HTH,

-Alex

 

From: Alina Kazi <[hidden email]>
Reply-To: "[hidden email]" <[hidden email]>
Date: Thursday, March 8, 2018 at 10:42 PM
To: "[hidden email]" <[hidden email]>
Subject: RE: EMULATION

 

Hi Alex,

I am using Apache Ant(TM) version 1.10.1 compiled on February 2 2017 Ant Java Version: 1.8

After Downloading file manually still issue is not resolved.

 

I am reinstalling the operating system Again.

 

Thanks,

Alina

 

From: Alex Harui [[hidden email]]
Sent: Friday, March 09, 2018 10:55 AM
To: [hidden email]
Subject: Re: EMULATION

 

Hi Alina,

 

I'm not sure why you are having problems with the downloads.  Could be your distance from the actual servers or some issue with Ant.  What version of Ant are you running?

 

The mirror.json part is just trying to download this file apache-flex-sdk-pixel-bender-1.0.0-bin.zip into the "in" folder.  Try doing that manually and see if the build goes past that point.

 

Thanks,

-Alex

 

From: Alina Kazi <[hidden email]>
Reply-To: "[hidden email]" <[hidden email]>
Date: Thursday, March 8, 2018 at 9:28 PM
To: "[hidden email]" <[hidden email]>
Subject: RE: EMULATION

 

Hi Alex,

 

 

Fetched all(3) folders from git 2 days earlier , while executing “ant all” or “ant” or “maven …..” Some Errors are occurred.

During the execution of ant all , Auto download wasn’t working So,Downloaded many files manually as the url was present right before the error every time and copying file to folder path that is also mention .

Now getting Error in mirror.json downloading.

https://www.dropbox.com/s/gv9wcvixr9mkcv9/error%20executing%20ant.png?dl=0

 

Thanks,

Alina

 

Reply | Threaded
Open this post in threaded view
|

RE: Royale Build Issue

alina kazi-2

Hi Alex

 

……

check-typedefs-home:

     [echo] ROYALE_TYPEDEFS_HOME is D:\prev\prev\royale-typedefs

     [echo] basedir is D:\prev\prev\royale-asjs

 

BUILD FAILED

D:\prev\prev\royale-asjs\build.xml:321: ROYALE_TYPEDEFS_HOME must be set to a folder containing js/target/js.swc such as the royale-typedefs repo

 

Total time: 42 seconds

D:\prev\prev\royale-asjs>

 

Environment variables :

 

https://www.dropbox.com/s/zxzvtrzqv834g3q/environment%20variable.png?dl=0

 

Thanks,

Alina

 

From: Alina Kazi [mailto:[hidden email]]
Sent: Tuesday, March 13, 2018 2:31 PM
To: [hidden email]
Subject: RE: Royale Build Issue

 

Hi Alex,

Downloaded and then manually downloaded swfobject_2_2 n so on..

When this process of downloading will be completed I will inform you.

 

Reference: https://raw.githubusercontent.com/wiki/apache/royale-asjs/Building-From-Source.md

  Notes :  `ROYALE_TYPEDEFS_HOME` can be used to point the build to a `royale-typedefs` clone in some place other than the default location.

 

 

check-typedefs-home:

     [echo] ROYALE_TYPEDEFS_HOME is ${env.ROYALE_TYPEDEFS_HOME}

     [echo] basedir is D:\prev\prev\royale-asjs

 

BUILD FAILED

D:\prev\prev\royale-asjs\build.xml:321: ROYALE_TYPEDEFS_HOME must be set to a folder containing js/target/js.swc such as the royale-typedefs repo

 

 

Thank you so much.

-Alina

 

 

From: Alex Harui [mailto:[hidden email]]
Sent: Tuesday, March 13, 2018 12:29 PM
To: [hidden email]
Subject: Re: Royale Build Issue

 

Hi Alina,

 

This output says you are now failing on flexunit, not pixelbender.

 

Try downloading manually: http://www.apache.org/dyn/mirrors/mirrors.cgi/flex/flexunit/4.2.0/binaries/apache-flex-flexunit-4.2.0-4.12.0-bin.zip

 

Put that zip file in the "in" folder and expand it.  It should create a flexunit folder in "in" so you should have many files one of which is:

 

in/flexunit/flexunit/flexunit-4.2.0-20140410-flex_4.12.0.swc

 

HTH,

-Alex

 

From: Alina Kazi <[hidden email]>
Reply-To: "[hidden email]" <[hidden email]>
Date: Monday, March 12, 2018 at 11:07 PM
To: "[hidden email]" <[hidden email]>
Subject: RE: Royale Build Issue

 

Hi Alex,

 

.pbj files aren’t erased .

Console Output:

https://www.dropbox.com/s/wq3qxdrpdywb25i/error%20ant.txt?dl=0

 

Can you please share all folders in Zip with all dependencies downloaded at my address: [hidden email]

 

 

Thanks,

Alina

 

 

From: Alex Harui [[hidden email]]
Sent: Tuesday, March 13, 2018 11:55 AM
To: [hidden email]
Subject: Re: Royale Build Issue

 

Hi Alina,

 

Please only use d:\prev\prev\royale-asjs for now.  Make sure the .pbj files haven't been erased somehow and run ant again and post the console output.

 

Thanks,

-Alex

 

From: Alina Kazi <[hidden email]>
Reply-To: "[hidden email]" <[hidden email]>
Date: Monday, March 12, 2018 at 10:07 PM
To: "[hidden email]" <[hidden email]>
Subject: RE: Royale Build Issue

 

Hi Alex,

D:\apache royale develop\royale-asjs

D:\apache\ royale-asjs

d:\prev\prev\royale-asjs

all are the folders that I tried on different time currently I have only one of them that is d:\prev\prev\royale-asjs

and I copied all .pbj files into d:\prev\prev\royale-asjs \frameworks/projects/Graphics/src/main/royale/org/apache/royale/graphics/utils/shaderClasses/

 

 

From: Alex Harui [[hidden email]]
Sent: Tuesday, March 13, 2018 11:13 AM
To: [hidden email]
Subject: Re: Royale Build Issue

 

Hi Alina,

 

I can't see the full set of folders in the first dropbox link.

 

In the second, it appears to be listing of d:\prev\prev\royale-asjs

 

However, the console output you posted two posts ago indicates you are running ant in D:\apache royale develop\royale-asjs

 

Please make sure that you are copying .pbj files to the right folders.  I would recommend using folder names without spaces just in case.

 

HTH,

-Alex

 

From: Alina Kazi <[hidden email]>
Reply-To: "[hidden email]" <[hidden email]>
Date: Monday, March 12, 2018 at 9:32 PM
To: "[hidden email]" <[hidden email]>
Subject: RE: Royale Build Issue

 

Hi Alex,

I followed all of your instructions:

https://www.dropbox.com/s/06jti95che7vu4o/pdj%20files%20added.png?dl=0

To verify that I  have copied the .pbj files correctly:

 

dir /s *.pbj

 

https://www.dropbox.com/s/idxdfm5xxm4bb64/pdjfiles.png?dl=0

 

 

If you would like to access my machine. I will share my teamviewer id and password.

 

Thanks,

Alina

 

 

From: Alex Harui [[hidden email]]
Sent: Tuesday, March 13, 2018 10:13 AM
To: [hidden email]
Subject: Re: Royale Build Issue

 

Hi Alina,

 

As I mentioned a couple of posts ago, it is better to copy the .pbj files.  Having the zip in the "in" folder won't prevent the script from trying to download pixel bender.

 

To verify that you have copied the .pbj files correctly, in Windows command prompt do:

 

dir /s *.pbj

 

There should be a set of .pbj files in frameworks/projects/Graphics/src/main/royale/org/apache/royale/graphics/utils/shaderClasses/

 

HTH,

-Alex

 

From: Alina Kazi <[hidden email]>
Reply-To: "[hidden email]" <[hidden email]>
Date: Monday, March 12, 2018 at 8:36 PM
To: "[hidden email]" <[hidden email]>
Subject: RE: Royale Build Issue

 

https://www.dropbox.com/s/gv9wcvixr9mkcv9/error%20executing%20ant.png?dl=0

Even after downloading this file apache-flex-sdk-pixel-bender-1.0.0-bin.zip into the "in" folder.  

 

Thanks ,

Alina

 

From: Alex Harui [[hidden email]]
Sent: Monday, March 12, 2018 9:06 PM
To: [hidden email]
Subject: Re: Royale Build Issue

 

What errors are you getting now?

 

From: Alina Kazi <[hidden email]>
Reply-To: "[hidden email]" <[hidden email]>
Date: Monday, March 12, 2018 at 2:57 AM
To: "[hidden email]" <[hidden email]>
Subject: Royale Build Issue

 

Hi Alex,

 

After windows reinstallation and copying .pbj files.

 

With configuration :

check-playerglobal-home:

     [echo] PLAYERGLOBAL_HOME is D:\playerglobal\player

     [echo] playerglobal.version is 11.1

     [echo] playerglobal.swc is D:\playerglobal\player/11.1/playerglobal.swc

 

check-air-home:

     [echo] AIR_HOME is D:\AdobeAIRSDK\bin

 

check-compiler-home:

     [echo] env.ROYALE_COMPILER_REPO is ${env.ROYALE_COMPILER_REPO}

     [echo] ROYALE_COMPILER_REPO is ${ROYALE_COMPILER_REPO}

     [echo] ROYALE_COMPILER_REPO is d:\Apache\royale-asjs/../royale-compiler

 

check-compile-env:

     [echo] OS: Windows 7 / 6.1 / amd64

     [echo] VM: Java HotSpot(TM) 64-Bit Server VM / 25.31-b07

     [echo] Java: 1.8.0_31

     [echo] Ant: Apache Ant(TM) version 1.10.2 compiled on February 3 2018 Ant Java Version: 1.8

 

And environment variable path:

PATH=C:\Windows\system32;C:\Windows;C:\Windows\System32\Wbem;C:\Windows\System32

\WindowsPowerShell\v1.0;C:\Program Files\Java\jdk1.8.0_31\bin;D:\apache-ant-1.10.2\bin;C:\Program Files\Git\cmd;D:\apache-maven-3.5.3\bin

 

Still getting Errors.

 

Please share git , maven , ant, java version.

 

Thanks,

Alina

____________________________________________________

From: Alex Harui [[hidden email]]
Sent: Friday, March 09, 2018 12:12 PM
To: [hidden email]
Subject: Re: EMULATION

 

Hi Alina,

 

I think you've downloaded a nightly build at some point.  To workaround the pixel bender problem, try copying all .pbj files from the nightly to the same folders in royale-asjs.

 

HTH,

-Alex

 

From: Alina Kazi <[hidden email]>
Reply-To: "[hidden email]" <[hidden email]>
Date: Thursday, March 8, 2018 at 10:42 PM
To: "[hidden email]" <[hidden email]>
Subject: RE: EMULATION

 

Hi Alex,

I am using Apache Ant(TM) version 1.10.1 compiled on February 2 2017 Ant Java Version: 1.8

After Downloading file manually still issue is not resolved.

 

I am reinstalling the operating system Again.

 

Thanks,

Alina

 

From: Alex Harui [[hidden email]]
Sent: Friday, March 09, 2018 10:55 AM
To: [hidden email]
Subject: Re: EMULATION

 

Hi Alina,

 

I'm not sure why you are having problems with the downloads.  Could be your distance from the actual servers or some issue with Ant.  What version of Ant are you running?

 

The mirror.json part is just trying to download this file apache-flex-sdk-pixel-bender-1.0.0-bin.zip into the "in" folder.  Try doing that manually and see if the build goes past that point.

 

Thanks,

-Alex

 

From: Alina Kazi <[hidden email]>
Reply-To: "[hidden email]" <[hidden email]>
Date: Thursday, March 8, 2018 at 9:28 PM
To: "[hidden email]" <[hidden email]>
Subject: RE: EMULATION

 

Hi Alex,

 

 

Fetched all(3) folders from git 2 days earlier , while executing “ant all” or “ant” or “maven …..” Some Errors are occurred.

During the execution of ant all , Auto download wasn’t working So,Downloaded many files manually as the url was present right before the error every time and copying file to folder path that is also mention .

Now getting Error in mirror.json downloading.

https://www.dropbox.com/s/gv9wcvixr9mkcv9/error%20executing%20ant.png?dl=0

 

Thanks,

Alina

 

Reply | Threaded
Open this post in threaded view
|

Re: Royale Build Issue

Alex Harui-2
Hi Alina, is there a D:\prev\prev\royale-typedefs folder?  If so, run "ant main" in that folder.  If not, it sounds like you have been moving files around.

I'm thinking it might be time to "start over" and set your computer up in a different way.  Let me know if you are interested in doing that or would rather just try to make your current setup work.  The advantage of starting over is that you will be able to set up quickly do a full delete and re-build in the future if you are having some other build problem.

Thanks,
-Alex

From: Alina Kazi <[hidden email]>
Reply-To: "[hidden email]" <[hidden email]>
Date: Tuesday, March 13, 2018 at 3:36 AM
To: "[hidden email]" <[hidden email]>
Subject: RE: Royale Build Issue

Hi Alex

 

……

check-typedefs-home:

     [echo] ROYALE_TYPEDEFS_HOME is D:\prev\prev\royale-typedefs

     [echo] basedir is D:\prev\prev\royale-asjs

 

BUILD FAILED

D:\prev\prev\royale-asjs\build.xml:321: ROYALE_TYPEDEFS_HOME must be set to a folder containing js/target/js.swc such as the royale-typedefs repo

 

Total time: 42 seconds

D:\prev\prev\royale-asjs>

 

Environment variables :

 

https://www.dropbox.com/s/zxzvtrzqv834g3q/environment%20variable.png?dl=0

 

Thanks,

Alina

 

From: Alina Kazi [[hidden email]]
Sent: Tuesday, March 13, 2018 2:31 PM
To: [hidden email]
Subject: RE: Royale Build Issue

 

Hi Alex,

Downloaded and then manually downloaded swfobject_2_2 n so on..

When this process of downloading will be completed I will inform you.

 

Reference: https://raw.githubusercontent.com/wiki/apache/royale-asjs/Building-From-Source.md

  Notes :  `ROYALE_TYPEDEFS_HOME` can be used to point the build to a `royale-typedefs` clone in some place other than the default location.

 

 

check-typedefs-home:

     [echo] ROYALE_TYPEDEFS_HOME is ${env.ROYALE_TYPEDEFS_HOME}

     [echo] basedir is D:\prev\prev\royale-asjs

 

BUILD FAILED

D:\prev\prev\royale-asjs\build.xml:321: ROYALE_TYPEDEFS_HOME must be set to a folder containing js/target/js.swc such as the royale-typedefs repo

 

 

Thank you so much.

-Alina

 

 

From: Alex Harui [[hidden email]]
Sent: Tuesday, March 13, 2018 12:29 PM
To: [hidden email]
Subject: Re: Royale Build Issue

 

Hi Alina,

 

This output says you are now failing on flexunit, not pixelbender.

 

Try downloading manually: http://www.apache.org/dyn/mirrors/mirrors.cgi/flex/flexunit/4.2.0/binaries/apache-flex-flexunit-4.2.0-4.12.0-bin.zip

 

Put that zip file in the "in" folder and expand it.  It should create a flexunit folder in "in" so you should have many files one of which is:

 

in/flexunit/flexunit/flexunit-4.2.0-20140410-flex_4.12.0.swc

 

HTH,

-Alex

 

From: Alina Kazi <[hidden email]>
Reply-To: "[hidden email]" <[hidden email]>
Date: Monday, March 12, 2018 at 11:07 PM
To: "[hidden email]" <[hidden email]>
Subject: RE: Royale Build Issue

 

Hi Alex,

 

.pbj files aren’t erased .

Console Output:

https://www.dropbox.com/s/wq3qxdrpdywb25i/error%20ant.txt?dl=0

 

Can you please share all folders in Zip with all dependencies downloaded at my address: [hidden email]

 

 

Thanks,

Alina

 

 

From: Alex Harui [[hidden email]]
Sent: Tuesday, March 13, 2018 11:55 AM
To: [hidden email]
Subject: Re: Royale Build Issue

 

Hi Alina,

 

Please only use d:\prev\prev\royale-asjs for now.  Make sure the .pbj files haven't been erased somehow and run ant again and post the console output.

 

Thanks,

-Alex

 

From: Alina Kazi <[hidden email]>
Reply-To: "[hidden email]" <[hidden email]>
Date: Monday, March 12, 2018 at 10:07 PM
To: "[hidden email]" <[hidden email]>
Subject: RE: Royale Build Issue

 

Hi Alex,

D:\apache royale develop\royale-asjs

D:\apache\ royale-asjs

d:\prev\prev\royale-asjs

all are the folders that I tried on different time currently I have only one of them that is d:\prev\prev\royale-asjs

and I copied all .pbj files into d:\prev\prev\royale-asjs \frameworks/projects/Graphics/src/main/royale/org/apache/royale/graphics/utils/shaderClasses/

 

 

From: Alex Harui [[hidden email]]
Sent: Tuesday, March 13, 2018 11:13 AM
To: [hidden email]
Subject: Re: Royale Build Issue

 

Hi Alina,

 

I can't see the full set of folders in the first dropbox link.

 

In the second, it appears to be listing of d:\prev\prev\royale-asjs

 

However, the console output you posted two posts ago indicates you are running ant in D:\apache royale develop\royale-asjs

 

Please make sure that you are copying .pbj files to the right folders.  I would recommend using folder names without spaces just in case.

 

HTH,

-Alex

 

From: Alina Kazi <[hidden email]>
Reply-To: "[hidden email]" <[hidden email]>
Date: Monday, March 12, 2018 at 9:32 PM
To: "[hidden email]" <[hidden email]>
Subject: RE: Royale Build Issue

 

Hi Alex,

I followed all of your instructions:

https://www.dropbox.com/s/06jti95che7vu4o/pdj%20files%20added.png?dl=0

To verify that I  have copied the .pbj files correctly:

 

dir /s *.pbj

 

https://www.dropbox.com/s/idxdfm5xxm4bb64/pdjfiles.png?dl=0

 

 

If you would like to access my machine. I will share my teamviewer id and password.

 

Thanks,

Alina

 

 

From: Alex Harui [[hidden email]]
Sent: Tuesday, March 13, 2018 10:13 AM
To: [hidden email]
Subject: Re: Royale Build Issue

 

Hi Alina,

 

As I mentioned a couple of posts ago, it is better to copy the .pbj files.  Having the zip in the "in" folder won't prevent the script from trying to download pixel bender.

 

To verify that you have copied the .pbj files correctly, in Windows command prompt do:

 

dir /s *.pbj

 

There should be a set of .pbj files in frameworks/projects/Graphics/src/main/royale/org/apache/royale/graphics/utils/shaderClasses/

 

HTH,

-Alex

 

From: Alina Kazi <[hidden email]>
Reply-To: "[hidden email]" <[hidden email]>
Date: Monday, March 12, 2018 at 8:36 PM
To: "[hidden email]" <[hidden email]>
Subject: RE: Royale Build Issue

 

https://www.dropbox.com/s/gv9wcvixr9mkcv9/error%20executing%20ant.png?dl=0

Even after downloading this file apache-flex-sdk-pixel-bender-1.0.0-bin.zip into the "in" folder.  

 

Thanks ,

Alina

 

From: Alex Harui [[hidden email]]
Sent: Monday, March 12, 2018 9:06 PM
To: [hidden email]
Subject: Re: Royale Build Issue

 

What errors are you getting now?

 

From: Alina Kazi <[hidden email]>
Reply-To: "[hidden email]" <[hidden email]>
Date: Monday, March 12, 2018 at 2:57 AM
To: "[hidden email]" <[hidden email]>
Subject: Royale Build Issue

 

Hi Alex,

 

After windows reinstallation and copying .pbj files.

 

With configuration :

check-playerglobal-home:

     [echo] PLAYERGLOBAL_HOME is D:\playerglobal\player

     [echo] playerglobal.version is 11.1

     [echo] playerglobal.swc is D:\playerglobal\player/11.1/playerglobal.swc

 

check-air-home:

     [echo] AIR_HOME is D:\AdobeAIRSDK\bin

 

check-compiler-home:

     [echo] env.ROYALE_COMPILER_REPO is ${env.ROYALE_COMPILER_REPO}

     [echo] ROYALE_COMPILER_REPO is ${ROYALE_COMPILER_REPO}

     [echo] ROYALE_COMPILER_REPO is d:\Apache\royale-asjs/../royale-compiler

 

check-compile-env:

     [echo] OS: Windows 7 / 6.1 / amd64

     [echo] VM: Java HotSpot(TM) 64-Bit Server VM / 25.31-b07

     [echo] Java: 1.8.0_31

     [echo] Ant: Apache Ant(TM) version 1.10.2 compiled on February 3 2018 Ant Java Version: 1.8

 

And environment variable path:

PATH=C:\Windows\system32;C:\Windows;C:\Windows\System32\Wbem;C:\Windows\System32

\WindowsPowerShell\v1.0;C:\Program Files\Java\jdk1.8.0_31\bin;D:\apache-ant-1.10.2\bin;C:\Program Files\Git\cmd;D:\apache-maven-3.5.3\bin

 

Still getting Errors.

 

Please share git , maven , ant, java version.

 

Thanks,

Alina

____________________________________________________

From: Alex Harui [[hidden email]]
Sent: Friday, March 09, 2018 12:12 PM
To: [hidden email]
Subject: Re: EMULATION

 

Hi Alina,

 

I think you've downloaded a nightly build at some point.  To workaround the pixel bender problem, try copying all .pbj files from the nightly to the same folders in royale-asjs.

 

HTH,

-Alex

 

From: Alina Kazi <[hidden email]>
Reply-To: "[hidden email]" <[hidden email]>
Date: Thursday, March 8, 2018 at 10:42 PM
To: "[hidden email]" <[hidden email]>
Subject: RE: EMULATION

 

Hi Alex,

I am using Apache Ant(TM) version 1.10.1 compiled on February 2 2017 Ant Java Version: 1.8

After Downloading file manually still issue is not resolved.

 

I am reinstalling the operating system Again.

 

Thanks,

Alina

 

From: Alex Harui [[hidden email]]
Sent: Friday, March 09, 2018 10:55 AM
To: [hidden email]
Subject: Re: EMULATION

 

Hi Alina,

 

I'm not sure why you are having problems with the downloads.  Could be your distance from the actual servers or some issue with Ant.  What version of Ant are you running?

 

The mirror.json part is just trying to download this file apache-flex-sdk-pixel-bender-1.0.0-bin.zip into the "in" folder.  Try doing that manually and see if the build goes past that point.

 

Thanks,

-Alex

 

From: Alina Kazi <[hidden email]>
Reply-To: "[hidden email]" <[hidden email]>
Date: Thursday, March 8, 2018 at 9:28 PM
To: "[hidden email]" <[hidden email]>
Subject: RE: EMULATION

 

Hi Alex,

 

 

Fetched all(3) folders from git 2 days earlier , while executing “ant all” or “ant” or “maven …..” Some Errors are occurred.

During the execution of ant all , Auto download wasn’t working So,Downloaded many files manually as the url was present right before the error every time and copying file to folder path that is also mention .

Now getting Error in mirror.json downloading.

https://www.dropbox.com/s/gv9wcvixr9mkcv9/error%20executing%20ant.png?dl=0

 

Thanks,

Alina

 

Reply | Threaded
Open this post in threaded view
|

RE: Royale Build Issue

alina kazi-2

Hi Alex,

 

After Run: ant main

in a D:\prev\prev\royale-typedefs folder

 

Error:

https://www.dropbox.com/s/0rc9exhc66vgh46/error%20ant%20main%20in%20typedefs.txt?dl=0

 

Folder Screenshot:

https://www.dropbox.com/s/a8exa9xp1pmgmp4/typedefs%20folder.png?dl=0

 

I definitely want to learn that how to create Emulation and want to contribute in Apache Royale.

 

Twice I deleted complete files and started from the step 1 and it was : git clone https://github.com/apache/royale-compiler.git royale-compiler
Again I downloaded all dependencies Manually one by one.
Still , I am stuck.
 
 

Thanks,

Alina

 

From: Alex Harui [mailto:[hidden email]]
Sent: Tuesday, March 13, 2018 9:23 PM
To: [hidden email]
Subject: Re: Royale Build Issue

 

Hi Alina, is there a D:\prev\prev\royale-typedefs folder?  If so, run "ant main" in that folder.  If not, it sounds like you have been moving files around.

 

I'm thinking it might be time to "start over" and set your computer up in a different way.  Let me know if you are interested in doing that or would rather just try to make your current setup work.  The advantage of starting over is that you will be able to set up quickly do a full delete and re-build in the future if you are having some other build problem.

 

Thanks,

-Alex

 

From: Alina Kazi <[hidden email]>
Reply-To: "[hidden email]" <[hidden email]>
Date: Tuesday, March 13, 2018 at 3:36 AM
To: "[hidden email]" <[hidden email]>
Subject: RE: Royale Build Issue

 

Hi Alex

 

……

check-typedefs-home:

     [echo] ROYALE_TYPEDEFS_HOME is D:\prev\prev\royale-typedefs

     [echo] basedir is D:\prev\prev\royale-asjs

 

BUILD FAILED

D:\prev\prev\royale-asjs\build.xml:321: ROYALE_TYPEDEFS_HOME must be set to a folder containing js/target/js.swc such as the royale-typedefs repo

 

Total time: 42 seconds

D:\prev\prev\royale-asjs>

 

Environment variables :

 

https://www.dropbox.com/s/zxzvtrzqv834g3q/environment%20variable.png?dl=0

 

Thanks,

Alina

 

From: Alina Kazi [[hidden email]]
Sent: Tuesday, March 13, 2018 2:31 PM
To: [hidden email]
Subject: RE: Royale Build Issue

 

Hi Alex,

Downloaded and then manually downloaded swfobject_2_2 n so on..

When this process of downloading will be completed I will inform you.

 

Reference: https://raw.githubusercontent.com/wiki/apache/royale-asjs/Building-From-Source.md

  Notes :  `ROYALE_TYPEDEFS_HOME` can be used to point the build to a `royale-typedefs` clone in some place other than the default location.

 

 

check-typedefs-home:

     [echo] ROYALE_TYPEDEFS_HOME is ${env.ROYALE_TYPEDEFS_HOME}

     [echo] basedir is D:\prev\prev\royale-asjs

 

BUILD FAILED

D:\prev\prev\royale-asjs\build.xml:321: ROYALE_TYPEDEFS_HOME must be set to a folder containing js/target/js.swc such as the royale-typedefs repo

 

 

Thank you so much.

-Alina

 

 

From: Alex Harui [[hidden email]]
Sent: Tuesday, March 13, 2018 12:29 PM
To: [hidden email]
Subject: Re: Royale Build Issue

 

Hi Alina,

 

This output says you are now failing on flexunit, not pixelbender.

 

Try downloading manually: http://www.apache.org/dyn/mirrors/mirrors.cgi/flex/flexunit/4.2.0/binaries/apache-flex-flexunit-4.2.0-4.12.0-bin.zip

 

Put that zip file in the "in" folder and expand it.  It should create a flexunit folder in "in" so you should have many files one of which is:

 

in/flexunit/flexunit/flexunit-4.2.0-20140410-flex_4.12.0.swc

 

HTH,

-Alex

 

From: Alina Kazi <[hidden email]>
Reply-To: "[hidden email]" <[hidden email]>
Date: Monday, March 12, 2018 at 11:07 PM
To: "[hidden email]" <[hidden email]>
Subject: RE: Royale Build Issue

 

Hi Alex,

 

.pbj files aren’t erased .

Console Output:

https://www.dropbox.com/s/wq3qxdrpdywb25i/error%20ant.txt?dl=0

 

Can you please share all folders in Zip with all dependencies downloaded at my address: [hidden email]

 

 

Thanks,

Alina

 

 

From: Alex Harui [[hidden email]]
Sent: Tuesday, March 13, 2018 11:55 AM
To: [hidden email]
Subject: Re: Royale Build Issue

 

Hi Alina,

 

Please only use d:\prev\prev\royale-asjs for now.  Make sure the .pbj files haven't been erased somehow and run ant again and post the console output.

 

Thanks,

-Alex

 

From: Alina Kazi <[hidden email]>
Reply-To: "[hidden email]" <[hidden email]>
Date: Monday, March 12, 2018 at 10:07 PM
To: "[hidden email]" <[hidden email]>
Subject: RE: Royale Build Issue

 

Hi Alex,

D:\apache royale develop\royale-asjs

D:\apache\ royale-asjs

d:\prev\prev\royale-asjs

all are the folders that I tried on different time currently I have only one of them that is d:\prev\prev\royale-asjs

and I copied all .pbj files into d:\prev\prev\royale-asjs \frameworks/projects/Graphics/src/main/royale/org/apache/royale/graphics/utils/shaderClasses/

 

 

From: Alex Harui [[hidden email]]
Sent: Tuesday, March 13, 2018 11:13 AM
To: [hidden email]
Subject: Re: Royale Build Issue

 

Hi Alina,

 

I can't see the full set of folders in the first dropbox link.

 

In the second, it appears to be listing of d:\prev\prev\royale-asjs

 

However, the console output you posted two posts ago indicates you are running ant in D:\apache royale develop\royale-asjs

 

Please make sure that you are copying .pbj files to the right folders.  I would recommend using folder names without spaces just in case.

 

HTH,

-Alex

 

From: Alina Kazi <[hidden email]>
Reply-To: "[hidden email]" <[hidden email]>
Date: Monday, March 12, 2018 at 9:32 PM
To: "[hidden email]" <[hidden email]>
Subject: RE: Royale Build Issue

 

Hi Alex,

I followed all of your instructions:

https://www.dropbox.com/s/06jti95che7vu4o/pdj%20files%20added.png?dl=0

To verify that I  have copied the .pbj files correctly:

 

dir /s *.pbj

 

https://www.dropbox.com/s/idxdfm5xxm4bb64/pdjfiles.png?dl=0

 

 

If you would like to access my machine. I will share my teamviewer id and password.

 

Thanks,

Alina

 

 

From: Alex Harui [[hidden email]]
Sent: Tuesday, March 13, 2018 10:13 AM
To: [hidden email]
Subject: Re: Royale Build Issue

 

Hi Alina,

 

As I mentioned a couple of posts ago, it is better to copy the .pbj files.  Having the zip in the "in" folder won't prevent the script from trying to download pixel bender.

 

To verify that you have copied the .pbj files correctly, in Windows command prompt do:

 

dir /s *.pbj

 

There should be a set of .pbj files in frameworks/projects/Graphics/src/main/royale/org/apache/royale/graphics/utils/shaderClasses/

 

HTH,

-Alex

 

From: Alina Kazi <[hidden email]>
Reply-To: "[hidden email]" <[hidden email]>
Date: Monday, March 12, 2018 at 8:36 PM
To: "[hidden email]" <[hidden email]>
Subject: RE: Royale Build Issue

 

https://www.dropbox.com/s/gv9wcvixr9mkcv9/error%20executing%20ant.png?dl=0

Even after downloading this file apache-flex-sdk-pixel-bender-1.0.0-bin.zip into the "in" folder.  

 

Thanks ,

Alina

 

From: Alex Harui [[hidden email]]
Sent: Monday, March 12, 2018 9:06 PM
To: [hidden email]
Subject: Re: Royale Build Issue

 

What errors are you getting now?

 

From: Alina Kazi <[hidden email]>
Reply-To: "[hidden email]" <[hidden email]>
Date: Monday, March 12, 2018 at 2:57 AM
To: "[hidden email]" <[hidden email]>
Subject: Royale Build Issue

 

Hi Alex,

 

After windows reinstallation and copying .pbj files.

 

With configuration :

check-playerglobal-home:

     [echo] PLAYERGLOBAL_HOME is D:\playerglobal\player

     [echo] playerglobal.version is 11.1

     [echo] playerglobal.swc is D:\playerglobal\player/11.1/playerglobal.swc

 

check-air-home:

     [echo] AIR_HOME is D:\AdobeAIRSDK\bin

 

check-compiler-home:

     [echo] env.ROYALE_COMPILER_REPO is ${env.ROYALE_COMPILER_REPO}

     [echo] ROYALE_COMPILER_REPO is ${ROYALE_COMPILER_REPO}

     [echo] ROYALE_COMPILER_REPO is d:\Apache\royale-asjs/../royale-compiler

 

check-compile-env:

     [echo] OS: Windows 7 / 6.1 / amd64

     [echo] VM: Java HotSpot(TM) 64-Bit Server VM / 25.31-b07

     [echo] Java: 1.8.0_31

     [echo] Ant: Apache Ant(TM) version 1.10.2 compiled on February 3 2018 Ant Java Version: 1.8

 

And environment variable path:

PATH=C:\Windows\system32;C:\Windows;C:\Windows\System32\Wbem;C:\Windows\System32

\WindowsPowerShell\v1.0;C:\Program Files\Java\jdk1.8.0_31\bin;D:\apache-ant-1.10.2\bin;C:\Program Files\Git\cmd;D:\apache-maven-3.5.3\bin

 

Still getting Errors.

 

Please share git , maven , ant, java version.

 

Thanks,

Alina

____________________________________________________

From: Alex Harui [[hidden email]]
Sent: Friday, March 09, 2018 12:12 PM
To: [hidden email]
Subject: Re: EMULATION

 

Hi Alina,

 

I think you've downloaded a nightly build at some point.  To workaround the pixel bender problem, try copying all .pbj files from the nightly to the same folders in royale-asjs.

 

HTH,

-Alex

 

From: Alina Kazi <[hidden email]>
Reply-To: "[hidden email]" <[hidden email]>
Date: Thursday, March 8, 2018 at 10:42 PM
To: "[hidden email]" <[hidden email]>
Subject: RE: EMULATION

 

Hi Alex,

I am using Apache Ant(TM) version 1.10.1 compiled on February 2 2017 Ant Java Version: 1.8

After Downloading file manually still issue is not resolved.

 

I am reinstalling the operating system Again.

 

Thanks,

Alina

 

From: Alex Harui [[hidden email]]
Sent: Friday, March 09, 2018 10:55 AM
To: [hidden email]
Subject: Re: EMULATION

 

Hi Alina,

 

I'm not sure why you are having problems with the downloads.  Could be your distance from the actual servers or some issue with Ant.  What version of Ant are you running?

 

The mirror.json part is just trying to download this file apache-flex-sdk-pixel-bender-1.0.0-bin.zip into the "in" folder.  Try doing that manually and see if the build goes past that point.

 

Thanks,

-Alex

 

From: Alina Kazi <[hidden email]>
Reply-To: "[hidden email]" <[hidden email]>
Date: Thursday, March 8, 2018 at 9:28 PM
To: "[hidden email]" <[hidden email]>
Subject: RE: EMULATION

 

Hi Alex,

 

 

Fetched all(3) folders from git 2 days earlier , while executing “ant all” or “ant” or “maven …..” Some Errors are occurred.

During the execution of ant all , Auto download wasn’t working So,Downloaded many files manually as the url was present right before the error every time and copying file to folder path that is also mention .

Now getting Error in mirror.json downloading.

https://www.dropbox.com/s/gv9wcvixr9mkcv9/error%20executing%20ant.png?dl=0

 

Thanks,

Alina

 

Reply | Threaded
Open this post in threaded view
|

RE: Royale Build Issue

alina kazi-2

Hi Alex,

 

Yesterday , on another machine , I installed just git, java 1.8.121 and  Apache Maven and added them to environment variable and 
to get the Apache Royale Compiler

git clone https://github.com/apache/royale-compiler.git royale-compiler

 

I just run the command :mvn clean install -P -main,utils inside royale-compiler and It seems working on that machine .

I will get all folders one by one and compile them. If successful, I Will let you know

 

Thanks

Alina

 

From: Alina Kazi [mailto:[hidden email]]
Sent: Thursday, March 15, 2018 9:22 AM
To: [hidden email]
Subject: RE: Royale Build Issue

 

Hi Alex,

 

After Run: ant main

in a D:\prev\prev\royale-typedefs folder

 

Error:

https://www.dropbox.com/s/0rc9exhc66vgh46/error%20ant%20main%20in%20typedefs.txt?dl=0

 

Folder Screenshot:

https://www.dropbox.com/s/a8exa9xp1pmgmp4/typedefs%20folder.png?dl=0

 

I definitely want to learn that how to create Emulation and want to contribute in Apache Royale.

 

Twice I deleted complete files and started from the step 1 and it was : git clone https://github.com/apache/royale-compiler.git royale-compiler
Again I downloaded all dependencies Manually one by one.
Still , I am stuck.
 
 

Thanks,

Alina

 

From: Alex Harui [mailto:[hidden email]]
Sent: Tuesday, March 13, 2018 9:23 PM
To: [hidden email]
Subject: Re: Royale Build Issue

 

Hi Alina, is there a D:\prev\prev\royale-typedefs folder?  If so, run "ant main" in that folder.  If not, it sounds like you have been moving files around.

 

I'm thinking it might be time to "start over" and set your computer up in a different way.  Let me know if you are interested in doing that or would rather just try to make your current setup work.  The advantage of starting over is that you will be able to set up quickly do a full delete and re-build in the future if you are having some other build problem.

 

Thanks,

-Alex

 

From: Alina Kazi <[hidden email]>
Reply-To: "[hidden email]" <[hidden email]>
Date: Tuesday, March 13, 2018 at 3:36 AM
To: "[hidden email]" <[hidden email]>
Subject: RE: Royale Build Issue

 

Hi Alex

 

……

check-typedefs-home:

     [echo] ROYALE_TYPEDEFS_HOME is D:\prev\prev\royale-typedefs

     [echo] basedir is D:\prev\prev\royale-asjs

 

BUILD FAILED

D:\prev\prev\royale-asjs\build.xml:321: ROYALE_TYPEDEFS_HOME must be set to a folder containing js/target/js.swc such as the royale-typedefs repo

 

Total time: 42 seconds

D:\prev\prev\royale-asjs>

 

Environment variables :

 

https://www.dropbox.com/s/zxzvtrzqv834g3q/environment%20variable.png?dl=0

 

Thanks,

Alina

 

From: Alina Kazi [[hidden email]]
Sent: Tuesday, March 13, 2018 2:31 PM
To: [hidden email]
Subject: RE: Royale Build Issue

 

Hi Alex,

Downloaded and then manually downloaded swfobject_2_2 n so on..

When this process of downloading will be completed I will inform you.

 

Reference: https://raw.githubusercontent.com/wiki/apache/royale-asjs/Building-From-Source.md

  Notes :  `ROYALE_TYPEDEFS_HOME` can be used to point the build to a `royale-typedefs` clone in some place other than the default location.

 

 

check-typedefs-home:

     [echo] ROYALE_TYPEDEFS_HOME is ${env.ROYALE_TYPEDEFS_HOME}

     [echo] basedir is D:\prev\prev\royale-asjs

 

BUILD FAILED

D:\prev\prev\royale-asjs\build.xml:321: ROYALE_TYPEDEFS_HOME must be set to a folder containing js/target/js.swc such as the royale-typedefs repo

 

 

Thank you so much.

-Alina

 

 

From: Alex Harui [[hidden email]]
Sent: Tuesday, March 13, 2018 12:29 PM
To: [hidden email]
Subject: Re: Royale Build Issue

 

Hi Alina,

 

This output says you are now failing on flexunit, not pixelbender.

 

Try downloading manually: http://www.apache.org/dyn/mirrors/mirrors.cgi/flex/flexunit/4.2.0/binaries/apache-flex-flexunit-4.2.0-4.12.0-bin.zip

 

Put that zip file in the "in" folder and expand it.  It should create a flexunit folder in "in" so you should have many files one of which is:

 

in/flexunit/flexunit/flexunit-4.2.0-20140410-flex_4.12.0.swc

 

HTH,

-Alex

 

From: Alina Kazi <[hidden email]>
Reply-To: "[hidden email]" <[hidden email]>
Date: Monday, March 12, 2018 at 11:07 PM
To: "[hidden email]" <[hidden email]>
Subject: RE: Royale Build Issue

 

Hi Alex,

 

.pbj files aren’t erased .

Console Output:

https://www.dropbox.com/s/wq3qxdrpdywb25i/error%20ant.txt?dl=0

 

Can you please share all folders in Zip with all dependencies downloaded at my address: [hidden email]

 

 

Thanks,

Alina

 

 

From: Alex Harui [[hidden email]]
Sent: Tuesday, March 13, 2018 11:55 AM
To: [hidden email]
Subject: Re: Royale Build Issue

 

Hi Alina,

 

Please only use d:\prev\prev\royale-asjs for now.  Make sure the .pbj files haven't been erased somehow and run ant again and post the console output.

 

Thanks,

-Alex

 

From: Alina Kazi <[hidden email]>
Reply-To: "[hidden email]" <[hidden email]>
Date: Monday, March 12, 2018 at 10:07 PM
To: "[hidden email]" <[hidden email]>
Subject: RE: Royale Build Issue

 

Hi Alex,

D:\apache royale develop\royale-asjs

D:\apache\ royale-asjs

d:\prev\prev\royale-asjs

all are the folders that I tried on different time currently I have only one of them that is d:\prev\prev\royale-asjs

and I copied all .pbj files into d:\prev\prev\royale-asjs \frameworks/projects/Graphics/src/main/royale/org/apache/royale/graphics/utils/shaderClasses/

 

 

From: Alex Harui [[hidden email]]
Sent: Tuesday, March 13, 2018 11:13 AM
To: [hidden email]
Subject: Re: Royale Build Issue

 

Hi Alina,

 

I can't see the full set of folders in the first dropbox link.

 

In the second, it appears to be listing of d:\prev\prev\royale-asjs

 

However, the console output you posted two posts ago indicates you are running ant in D:\apache royale develop\royale-asjs

 

Please make sure that you are copying .pbj files to the right folders.  I would recommend using folder names without spaces just in case.

 

HTH,

-Alex

 

From: Alina Kazi <[hidden email]>
Reply-To: "[hidden email]" <[hidden email]>
Date: Monday, March 12, 2018 at 9:32 PM
To: "[hidden email]" <[hidden email]>
Subject: RE: Royale Build Issue

 

Hi Alex,

I followed all of your instructions:

https://www.dropbox.com/s/06jti95che7vu4o/pdj%20files%20added.png?dl=0

To verify that I  have copied the .pbj files correctly:

 

dir /s *.pbj

 

https://www.dropbox.com/s/idxdfm5xxm4bb64/pdjfiles.png?dl=0

 

 

If you would like to access my machine. I will share my teamviewer id and password.

 

Thanks,

Alina

 

 

From: Alex Harui [[hidden email]]
Sent: Tuesday, March 13, 2018 10:13 AM
To: [hidden email]
Subject: Re: Royale Build Issue

 

Hi Alina,

 

As I mentioned a couple of posts ago, it is better to copy the .pbj files.  Having the zip in the "in" folder won't prevent the script from trying to download pixel bender.

 

To verify that you have copied the .pbj files correctly, in Windows command prompt do:

 

dir /s *.pbj

 

There should be a set of .pbj files in frameworks/projects/Graphics/src/main/royale/org/apache/royale/graphics/utils/shaderClasses/

 

HTH,

-Alex

 

From: Alina Kazi <[hidden email]>
Reply-To: "[hidden email]" <[hidden email]>
Date: Monday, March 12, 2018 at 8:36 PM
To: "[hidden email]" <[hidden email]>
Subject: RE: Royale Build Issue

 

https://www.dropbox.com/s/gv9wcvixr9mkcv9/error%20executing%20ant.png?dl=0

Even after downloading this file apache-flex-sdk-pixel-bender-1.0.0-bin.zip into the "in" folder.  

 

Thanks ,

Alina

 

From: Alex Harui [[hidden email]]
Sent: Monday, March 12, 2018 9:06 PM
To: [hidden email]
Subject: Re: Royale Build Issue

 

What errors are you getting now?

 

From: Alina Kazi <[hidden email]>
Reply-To: "[hidden email]" <[hidden email]>
Date: Monday, March 12, 2018 at 2:57 AM
To: "[hidden email]" <[hidden email]>
Subject: Royale Build Issue

 

Hi Alex,

 

After windows reinstallation and copying .pbj files.

 

With configuration :

check-playerglobal-home:

     [echo] PLAYERGLOBAL_HOME is D:\playerglobal\player

     [echo] playerglobal.version is 11.1

     [echo] playerglobal.swc is D:\playerglobal\player/11.1/playerglobal.swc

 

check-air-home:

     [echo] AIR_HOME is D:\AdobeAIRSDK\bin

 

check-compiler-home:

     [echo] env.ROYALE_COMPILER_REPO is ${env.ROYALE_COMPILER_REPO}

     [echo] ROYALE_COMPILER_REPO is ${ROYALE_COMPILER_REPO}

     [echo] ROYALE_COMPILER_REPO is d:\Apache\royale-asjs/../royale-compiler

 

check-compile-env:

     [echo] OS: Windows 7 / 6.1 / amd64

     [echo] VM: Java HotSpot(TM) 64-Bit Server VM / 25.31-b07

     [echo] Java: 1.8.0_31

     [echo] Ant: Apache Ant(TM) version 1.10.2 compiled on February 3 2018 Ant Java Version: 1.8

 

And environment variable path:

PATH=C:\Windows\system32;C:\Windows;C:\Windows\System32\Wbem;C:\Windows\System32

\WindowsPowerShell\v1.0;C:\Program Files\Java\jdk1.8.0_31\bin;D:\apache-ant-1.10.2\bin;C:\Program Files\Git\cmd;D:\apache-maven-3.5.3\bin

 

Still getting Errors.

 

Please share git , maven , ant, java version.

 

Thanks,

Alina

____________________________________________________

From: Alex Harui [[hidden email]]
Sent: Friday, March 09, 2018 12:12 PM
To: [hidden email]
Subject: Re: EMULATION

 

Hi Alina,

 

I think you've downloaded a nightly build at some point.  To workaround the pixel bender problem, try copying all .pbj files from the nightly to the same folders in royale-asjs.

 

HTH,

-Alex

 

From: Alina Kazi <[hidden email]>
Reply-To: "[hidden email]" <[hidden email]>
Date: Thursday, March 8, 2018 at 10:42 PM
To: "[hidden email]" <[hidden email]>
Subject: RE: EMULATION

 

Hi Alex,

I am using Apache Ant(TM) version 1.10.1 compiled on February 2 2017 Ant Java Version: 1.8

After Downloading file manually still issue is not resolved.

 

I am reinstalling the operating system Again.

 

Thanks,

Alina

 

From: Alex Harui [[hidden email]]
Sent: Friday, March 09, 2018 10:55 AM
To: [hidden email]
Subject: Re: EMULATION

 

Hi Alina,

 

I'm not sure why you are having problems with the downloads.  Could be your distance from the actual servers or some issue with Ant.  What version of Ant are you running?

 

The mirror.json part is just trying to download this file apache-flex-sdk-pixel-bender-1.0.0-bin.zip into the "in" folder.  Try doing that manually and see if the build goes past that point.

 

Thanks,

-Alex

 

From: Alina Kazi <[hidden email]>
Reply-To: "[hidden email]" <[hidden email]>
Date: Thursday, March 8, 2018 at 9:28 PM
To: "[hidden email]" <[hidden email]>
Subject: RE: EMULATION

 

Hi Alex,

 

 

Fetched all(3) folders from git 2 days earlier , while executing “ant all” or “ant” or “maven …..” Some Errors are occurred.

During the execution of ant all , Auto download wasn’t working So,Downloaded many files manually as the url was present right before the error every time and copying file to folder path that is also mention .

Now getting Error in mirror.json downloading.

https://www.dropbox.com/s/gv9wcvixr9mkcv9/error%20executing%20ant.png?dl=0

 

Thanks,

Alina

 

Reply | Threaded
Open this post in threaded view
|

Re: Royale Build Issue

Alex Harui-2
In reply to this post by alina kazi-2
Hi Alina,

It sounds like Ant and maybe even Maven have trouble downloading files to your computer.  I am going to look into some alternative ways for you to get the downloads when I start my workday tomorrow (about 8 hours from now).

Thanks,
-Alex

From: Alina Kazi <[hidden email]>
Reply-To: "[hidden email]" <[hidden email]>
Date: Wednesday, March 14, 2018 at 8:21 PM
To: "[hidden email]" <[hidden email]>
Subject: RE: Royale Build Issue

Hi Alex,

 

After Run: ant main

in a D:\prev\prev\royale-typedefs folder

 

Error:

https://www.dropbox.com/s/0rc9exhc66vgh46/error%20ant%20main%20in%20typedefs.txt?dl=0

 

Folder Screenshot:

https://www.dropbox.com/s/a8exa9xp1pmgmp4/typedefs%20folder.png?dl=0

 

I definitely want to learn that how to create Emulation and want to contribute in Apache Royale.

 

Twice I deleted complete files and started from the step 1 and it was : git clone https://github.com/apache/royale-compiler.git royale-compiler
Again I downloaded all dependencies Manually one by one.
Still , I am stuck.
 
 

Thanks,

Alina

 

From: Alex Harui [[hidden email]]
Sent: Tuesday, March 13, 2018 9:23 PM
To: [hidden email]
Subject: Re: Royale Build Issue

 

Hi Alina, is there a D:\prev\prev\royale-typedefs folder?  If so, run "ant main" in that folder.  If not, it sounds like you have been moving files around.

 

I'm thinking it might be time to "start over" and set your computer up in a different way.  Let me know if you are interested in doing that or would rather just try to make your current setup work.  The advantage of starting over is that you will be able to set up quickly do a full delete and re-build in the future if you are having some other build problem.

 

Thanks,

-Alex

 

From: Alina Kazi <[hidden email]>
Reply-To: "[hidden email]" <[hidden email]>
Date: Tuesday, March 13, 2018 at 3:36 AM
To: "[hidden email]" <[hidden email]>
Subject: RE: Royale Build Issue

 

Hi Alex

 

……

check-typedefs-home:

     [echo] ROYALE_TYPEDEFS_HOME is D:\prev\prev\royale-typedefs

     [echo] basedir is D:\prev\prev\royale-asjs

 

BUILD FAILED

D:\prev\prev\royale-asjs\build.xml:321: ROYALE_TYPEDEFS_HOME must be set to a folder containing js/target/js.swc such as the royale-typedefs repo

 

Total time: 42 seconds

D:\prev\prev\royale-asjs>

 

Environment variables :

 

https://www.dropbox.com/s/zxzvtrzqv834g3q/environment%20variable.png?dl=0

 

Thanks,

Alina

 

From: Alina Kazi [[hidden email]]
Sent: Tuesday, March 13, 2018 2:31 PM
To: [hidden email]
Subject: RE: Royale Build Issue

 

Hi Alex,

Downloaded and then manually downloaded swfobject_2_2 n so on..

When this process of downloading will be completed I will inform you.

 

Reference: https://raw.githubusercontent.com/wiki/apache/royale-asjs/Building-From-Source.md

  Notes :  `ROYALE_TYPEDEFS_HOME` can be used to point the build to a `royale-typedefs` clone in some place other than the default location.

 

 

check-typedefs-home:

     [echo] ROYALE_TYPEDEFS_HOME is ${env.ROYALE_TYPEDEFS_HOME}

     [echo] basedir is D:\prev\prev\royale-asjs

 

BUILD FAILED

D:\prev\prev\royale-asjs\build.xml:321: ROYALE_TYPEDEFS_HOME must be set to a folder containing js/target/js.swc such as the royale-typedefs repo

 

 

Thank you so much.

-Alina

 

 

From: Alex Harui [[hidden email]]
Sent: Tuesday, March 13, 2018 12:29 PM
To: [hidden email]
Subject: Re: Royale Build Issue

 

Hi Alina,

 

This output says you are now failing on flexunit, not pixelbender.

 

Try downloading manually: http://www.apache.org/dyn/mirrors/mirrors.cgi/flex/flexunit/4.2.0/binaries/apache-flex-flexunit-4.2.0-4.12.0-bin.zip

 

Put that zip file in the "in" folder and expand it.  It should create a flexunit folder in "in" so you should have many files one of which is:

 

in/flexunit/flexunit/flexunit-4.2.0-20140410-flex_4.12.0.swc

 

HTH,

-Alex

 

From: Alina Kazi <[hidden email]>
Reply-To: "[hidden email]" <[hidden email]>
Date: Monday, March 12, 2018 at 11:07 PM
To: "[hidden email]" <[hidden email]>
Subject: RE: Royale Build Issue

 

Hi Alex,

 

.pbj files aren’t erased .

Console Output:

https://www.dropbox.com/s/wq3qxdrpdywb25i/error%20ant.txt?dl=0

 

Can you please share all folders in Zip with all dependencies downloaded at my address: [hidden email]

 

 

Thanks,

Alina

 

 

From: Alex Harui [[hidden email]]
Sent: Tuesday, March 13, 2018 11:55 AM
To: [hidden email]
Subject: Re: Royale Build Issue

 

Hi Alina,

 

Please only use d:\prev\prev\royale-asjs for now.  Make sure the .pbj files haven't been erased somehow and run ant again and post the console output.

 

Thanks,

-Alex

 

From: Alina Kazi <[hidden email]>
Reply-To: "[hidden email]" <[hidden email]>
Date: Monday, March 12, 2018 at 10:07 PM
To: "[hidden email]" <[hidden email]>
Subject: RE: Royale Build Issue

 

Hi Alex,

D:\apache royale develop\royale-asjs

D:\apache\ royale-asjs

d:\prev\prev\royale-asjs

all are the folders that I tried on different time currently I have only one of them that is d:\prev\prev\royale-asjs

and I copied all .pbj files into d:\prev\prev\royale-asjs \frameworks/projects/Graphics/src/main/royale/org/apache/royale/graphics/utils/shaderClasses/

 

 

From: Alex Harui [[hidden email]]
Sent: Tuesday, March 13, 2018 11:13 AM
To: [hidden email]
Subject: Re: Royale Build Issue

 

Hi Alina,

 

I can't see the full set of folders in the first dropbox link.

 

In the second, it appears to be listing of d:\prev\prev\royale-asjs

 

However, the console output you posted two posts ago indicates you are running ant in D:\apache royale develop\royale-asjs

 

Please make sure that you are copying .pbj files to the right folders.  I would recommend using folder names without spaces just in case.

 

HTH,

-Alex

 

From: Alina Kazi <[hidden email]>
Reply-To: "[hidden email]" <[hidden email]>
Date: Monday, March 12, 2018 at 9:32 PM
To: "[hidden email]" <[hidden email]>
Subject: RE: Royale Build Issue

 

Hi Alex,

I followed all of your instructions:

https://www.dropbox.com/s/06jti95che7vu4o/pdj%20files%20added.png?dl=0

To verify that I  have copied the .pbj files correctly:

 

dir /s *.pbj

 

https://www.dropbox.com/s/idxdfm5xxm4bb64/pdjfiles.png?dl=0

 

 

If you would like to access my machine. I will share my teamviewer id and password.

 

Thanks,

Alina

 

 

From: Alex Harui [[hidden email]]
Sent: Tuesday, March 13, 2018 10:13 AM
To: [hidden email]
Subject: Re: Royale Build Issue

 

Hi Alina,

 

As I mentioned a couple of posts ago, it is better to copy the .pbj files.  Having the zip in the "in" folder won't prevent the script from trying to download pixel bender.

 

To verify that you have copied the .pbj files correctly, in Windows command prompt do:

 

dir /s *.pbj

 

There should be a set of .pbj files in frameworks/projects/Graphics/src/main/royale/org/apache/royale/graphics/utils/shaderClasses/

 

HTH,

-Alex

 

From: Alina Kazi <[hidden email]>
Reply-To: "[hidden email]" <[hidden email]>
Date: Monday, March 12, 2018 at 8:36 PM
To: "[hidden email]" <[hidden email]>
Subject: RE: Royale Build Issue

 

https://www.dropbox.com/s/gv9wcvixr9mkcv9/error%20executing%20ant.png?dl=0

Even after downloading this file apache-flex-sdk-pixel-bender-1.0.0-bin.zip into the "in" folder.  

 

Thanks ,

Alina

 

From: Alex Harui [[hidden email]]
Sent: Monday, March 12, 2018 9:06 PM
To: [hidden email]
Subject: Re: Royale Build Issue

 

What errors are you getting now?

 

From: Alina Kazi <[hidden email]>
Reply-To: "[hidden email]" <[hidden email]>
Date: Monday, March 12, 2018 at 2:57 AM
To: "[hidden email]" <[hidden email]>
Subject: Royale Build Issue

 

Hi Alex,

 

After windows reinstallation and copying .pbj files.

 

With configuration :

check-playerglobal-home:

     [echo] PLAYERGLOBAL_HOME is D:\playerglobal\player

     [echo] playerglobal.version is 11.1

     [echo] playerglobal.swc is D:\playerglobal\player/11.1/playerglobal.swc

 

check-air-home:

     [echo] AIR_HOME is D:\AdobeAIRSDK\bin

 

check-compiler-home:

     [echo] env.ROYALE_COMPILER_REPO is ${env.ROYALE_COMPILER_REPO}

     [echo] ROYALE_COMPILER_REPO is ${ROYALE_COMPILER_REPO}

     [echo] ROYALE_COMPILER_REPO is d:\Apache\royale-asjs/../royale-compiler

 

check-compile-env:

     [echo] OS: Windows 7 / 6.1 / amd64

     [echo] VM: Java HotSpot(TM) 64-Bit Server VM / 25.31-b07

     [echo] Java: 1.8.0_31

     [echo] Ant: Apache Ant(TM) version 1.10.2 compiled on February 3 2018 Ant Java Version: 1.8

 

And environment variable path:

PATH=C:\Windows\system32;C:\Windows;C:\Windows\System32\Wbem;C:\Windows\System32

\WindowsPowerShell\v1.0;C:\Program Files\Java\jdk1.8.0_31\bin;D:\apache-ant-1.10.2\bin;C:\Program Files\Git\cmd;D:\apache-maven-3.5.3\bin

 

Still getting Errors.

 

Please share git , maven , ant, java version.

 

Thanks,

Alina

____________________________________________________

From: Alex Harui [[hidden email]]
Sent: Friday, March 09, 2018 12:12 PM
To: [hidden email]
Subject: Re: EMULATION

 

Hi Alina,

 

I think you've downloaded a nightly build at some point.  To workaround the pixel bender problem, try copying all .pbj files from the nightly to the same folders in royale-asjs.

 

HTH,

-Alex

 

From: Alina Kazi <[hidden email]>
Reply-To: "[hidden email]" <[hidden email]>
Date: Thursday, March 8, 2018 at 10:42 PM
To: "[hidden email]" <[hidden email]>
Subject: RE: EMULATION

 

Hi Alex,

I am using Apache Ant(TM) version 1.10.1 compiled on February 2 2017 Ant Java Version: 1.8

After Downloading file manually still issue is not resolved.

 

I am reinstalling the operating system Again.

 

Thanks,

Alina

 

From: Alex Harui [[hidden email]]
Sent: Friday, March 09, 2018 10:55 AM
To: [hidden email]
Subject: Re: EMULATION

 

Hi Alina,

 

I'm not sure why you are having problems with the downloads.  Could be your distance from the actual servers or some issue with Ant.  What version of Ant are you running?

 

The mirror.json part is just trying to download this file apache-flex-sdk-pixel-bender-1.0.0-bin.zip into the "in" folder.  Try doing that manually and see if the build goes past that point.

 

Thanks,

-Alex

 

From: Alina Kazi <[hidden email]>
Reply-To: "[hidden email]" <[hidden email]>
Date: Thursday, March 8, 2018 at 9:28 PM
To: "[hidden email]" <[hidden email]>
Subject: RE: EMULATION

 

Hi Alex,

 

 

Fetched all(3) folders from git 2 days earlier , while executing “ant all” or “ant” or “maven …..” Some Errors are occurred.

During the execution of ant all , Auto download wasn’t working So,Downloaded many files manually as the url was present right before the error every time and copying file to folder path that is also mention .

Now getting Error in mirror.json downloading.

https://www.dropbox.com/s/gv9wcvixr9mkcv9/error%20executing%20ant.png?dl=0

 

Thanks,

Alina

 

Reply | Threaded
Open this post in threaded view
|

RE: Royale Build Issue

alina kazi-2

Alright . Thanks

 

-Alina

 

From: Alex Harui [mailto:[hidden email]]
Sent: Thursday, March 15, 2018 12:11 PM
To: [hidden email]
Subject: Re: Royale Build Issue

 

Hi Alina,

 

It sounds like Ant and maybe even Maven have trouble downloading files to your computer.  I am going to look into some alternative ways for you to get the downloads when I start my workday tomorrow (about 8 hours from now).

 

Thanks,

-Alex

 

From: Alina Kazi <[hidden email]>
Reply-To: "[hidden email]" <[hidden email]>
Date: Wednesday, March 14, 2018 at 8:21 PM
To: "[hidden email]" <[hidden email]>
Subject: RE: Royale Build Issue

 

Hi Alex,

 

After Run: ant main

in a D:\prev\prev\royale-typedefs folder

 

Error:

https://www.dropbox.com/s/0rc9exhc66vgh46/error%20ant%20main%20in%20typedefs.txt?dl=0

 

Folder Screenshot:

https://www.dropbox.com/s/a8exa9xp1pmgmp4/typedefs%20folder.png?dl=0

 

I definitely want to learn that how to create Emulation and want to contribute in Apache Royale.

 

Twice I deleted complete files and started from the step 1 and it was : git clone https://github.com/apache/royale-compiler.git royale-compiler
Again I downloaded all dependencies Manually one by one.
Still , I am stuck.
 
 

Thanks,

Alina

 

From: Alex Harui [[hidden email]]
Sent: Tuesday, March 13, 2018 9:23 PM
To: [hidden email]
Subject: Re: Royale Build Issue

 

Hi Alina, is there a D:\prev\prev\royale-typedefs folder?  If so, run "ant main" in that folder.  If not, it sounds like you have been moving files around.

 

I'm thinking it might be time to "start over" and set your computer up in a different way.  Let me know if you are interested in doing that or would rather just try to make your current setup work.  The advantage of starting over is that you will be able to set up quickly do a full delete and re-build in the future if you are having some other build problem.

 

Thanks,

-Alex

 

From: Alina Kazi <[hidden email]>
Reply-To: "[hidden email]" <[hidden email]>
Date: Tuesday, March 13, 2018 at 3:36 AM
To: "[hidden email]" <[hidden email]>
Subject: RE: Royale Build Issue

 

Hi Alex

 

……

check-typedefs-home:

     [echo] ROYALE_TYPEDEFS_HOME is D:\prev\prev\royale-typedefs

     [echo] basedir is D:\prev\prev\royale-asjs

 

BUILD FAILED

D:\prev\prev\royale-asjs\build.xml:321: ROYALE_TYPEDEFS_HOME must be set to a folder containing js/target/js.swc such as the royale-typedefs repo

 

Total time: 42 seconds

D:\prev\prev\royale-asjs>

 

Environment variables :

 

https://www.dropbox.com/s/zxzvtrzqv834g3q/environment%20variable.png?dl=0

 

Thanks,

Alina

 

From: Alina Kazi [[hidden email]]
Sent: Tuesday, March 13, 2018 2:31 PM
To: [hidden email]
Subject: RE: Royale Build Issue

 

Hi Alex,

Downloaded and then manually downloaded swfobject_2_2 n so on..

When this process of downloading will be completed I will inform you.

 

Reference: https://raw.githubusercontent.com/wiki/apache/royale-asjs/Building-From-Source.md

  Notes :  `ROYALE_TYPEDEFS_HOME` can be used to point the build to a `royale-typedefs` clone in some place other than the default location.

 

 

check-typedefs-home:

     [echo] ROYALE_TYPEDEFS_HOME is ${env.ROYALE_TYPEDEFS_HOME}

     [echo] basedir is D:\prev\prev\royale-asjs

 

BUILD FAILED

D:\prev\prev\royale-asjs\build.xml:321: ROYALE_TYPEDEFS_HOME must be set to a folder containing js/target/js.swc such as the royale-typedefs repo

 

 

Thank you so much.

-Alina

 

 

From: Alex Harui [[hidden email]]
Sent: Tuesday, March 13, 2018 12:29 PM
To: [hidden email]
Subject: Re: Royale Build Issue

 

Hi Alina,

 

This output says you are now failing on flexunit, not pixelbender.

 

Try downloading manually: http://www.apache.org/dyn/mirrors/mirrors.cgi/flex/flexunit/4.2.0/binaries/apache-flex-flexunit-4.2.0-4.12.0-bin.zip

 

Put that zip file in the "in" folder and expand it.  It should create a flexunit folder in "in" so you should have many files one of which is:

 

in/flexunit/flexunit/flexunit-4.2.0-20140410-flex_4.12.0.swc

 

HTH,

-Alex

 

From: Alina Kazi <[hidden email]>
Reply-To: "[hidden email]" <[hidden email]>
Date: Monday, March 12, 2018 at 11:07 PM
To: "[hidden email]" <[hidden email]>
Subject: RE: Royale Build Issue

 

Hi Alex,

 

.pbj files aren’t erased .

Console Output:

https://www.dropbox.com/s/wq3qxdrpdywb25i/error%20ant.txt?dl=0

 

Can you please share all folders in Zip with all dependencies downloaded at my address: [hidden email]

 

 

Thanks,

Alina

 

 

From: Alex Harui [[hidden email]]
Sent: Tuesday, March 13, 2018 11:55 AM
To: [hidden email]
Subject: Re: Royale Build Issue

 

Hi Alina,

 

Please only use d:\prev\prev\royale-asjs for now.  Make sure the .pbj files haven't been erased somehow and run ant again and post the console output.

 

Thanks,

-Alex

 

From: Alina Kazi <[hidden email]>
Reply-To: "[hidden email]" <[hidden email]>
Date: Monday, March 12, 2018 at 10:07 PM
To: "[hidden email]" <[hidden email]>
Subject: RE: Royale Build Issue

 

Hi Alex,

D:\apache royale develop\royale-asjs

D:\apache\ royale-asjs

d:\prev\prev\royale-asjs

all are the folders that I tried on different time currently I have only one of them that is d:\prev\prev\royale-asjs

and I copied all .pbj files into d:\prev\prev\royale-asjs \frameworks/projects/Graphics/src/main/royale/org/apache/royale/graphics/utils/shaderClasses/

 

 

From: Alex Harui [[hidden email]]
Sent: Tuesday, March 13, 2018 11:13 AM
To: [hidden email]
Subject: Re: Royale Build Issue

 

Hi Alina,

 

I can't see the full set of folders in the first dropbox link.

 

In the second, it appears to be listing of d:\prev\prev\royale-asjs

 

However, the console output you posted two posts ago indicates you are running ant in D:\apache royale develop\royale-asjs

 

Please make sure that you are copying .pbj files to the right folders.  I would recommend using folder names without spaces just in case.

 

HTH,

-Alex

 

From: Alina Kazi <[hidden email]>
Reply-To: "[hidden email]" <[hidden email]>
Date: Monday, March 12, 2018 at 9:32 PM
To: "[hidden email]" <[hidden email]>
Subject: RE: Royale Build Issue

 

Hi Alex,

I followed all of your instructions:

https://www.dropbox.com/s/06jti95che7vu4o/pdj%20files%20added.png?dl=0

To verify that I  have copied the .pbj files correctly:

 

dir /s *.pbj

 

https://www.dropbox.com/s/idxdfm5xxm4bb64/pdjfiles.png?dl=0

 

 

If you would like to access my machine. I will share my teamviewer id and password.

 

Thanks,

Alina

 

 

From: Alex Harui [[hidden email]]
Sent: Tuesday, March 13, 2018 10:13 AM
To: [hidden email]
Subject: Re: Royale Build Issue

 

Hi Alina,

 

As I mentioned a couple of posts ago, it is better to copy the .pbj files.  Having the zip in the "in" folder won't prevent the script from trying to download pixel bender.

 

To verify that you have copied the .pbj files correctly, in Windows command prompt do:

 

dir /s *.pbj

 

There should be a set of .pbj files in frameworks/projects/Graphics/src/main/royale/org/apache/royale/graphics/utils/shaderClasses/

 

HTH,

-Alex

 

From: Alina Kazi <[hidden email]>
Reply-To: "[hidden email]" <[hidden email]>
Date: Monday, March 12, 2018 at 8:36 PM
To: "[hidden email]" <[hidden email]>
Subject: RE: Royale Build Issue

 

https://www.dropbox.com/s/gv9wcvixr9mkcv9/error%20executing%20ant.png?dl=0

Even after downloading this file apache-flex-sdk-pixel-bender-1.0.0-bin.zip into the "in" folder.  

 

Thanks ,

Alina

 

From: Alex Harui [[hidden email]]
Sent: Monday, March 12, 2018 9:06 PM
To: [hidden email]
Subject: Re: Royale Build Issue

 

What errors are you getting now?

 

From: Alina Kazi <[hidden email]>
Reply-To: "[hidden email]" <[hidden email]>
Date: Monday, March 12, 2018 at 2:57 AM
To: "[hidden email]" <[hidden email]>
Subject: Royale Build Issue

 

Hi Alex,

 

After windows reinstallation and copying .pbj files.

 

With configuration :

check-playerglobal-home:

     [echo] PLAYERGLOBAL_HOME is D:\playerglobal\player

     [echo] playerglobal.version is 11.1

     [echo] playerglobal.swc is D:\playerglobal\player/11.1/playerglobal.swc

 

check-air-home:

     [echo] AIR_HOME is D:\AdobeAIRSDK\bin

 

check-compiler-home:

     [echo] env.ROYALE_COMPILER_REPO is ${env.ROYALE_COMPILER_REPO}

     [echo] ROYALE_COMPILER_REPO is ${ROYALE_COMPILER_REPO}

     [echo] ROYALE_COMPILER_REPO is d:\Apache\royale-asjs/../royale-compiler

 

check-compile-env:

     [echo] OS: Windows 7 / 6.1 / amd64

     [echo] VM: Java HotSpot(TM) 64-Bit Server VM / 25.31-b07

     [echo] Java: 1.8.0_31

     [echo] Ant: Apache Ant(TM) version 1.10.2 compiled on February 3 2018 Ant Java Version: 1.8

 

And environment variable path:

PATH=C:\Windows\system32;C:\Windows;C:\Windows\System32\Wbem;C:\Windows\System32

\WindowsPowerShell\v1.0;C:\Program Files\Java\jdk1.8.0_31\bin;D:\apache-ant-1.10.2\bin;C:\Program Files\Git\cmd;D:\apache-maven-3.5.3\bin

 

Still getting Errors.

 

Please share git , maven , ant, java version.

 

Thanks,

Alina

____________________________________________________

From: Alex Harui [[hidden email]]
Sent: Friday, March 09, 2018 12:12 PM
To: [hidden email]
Subject: Re: EMULATION

 

Hi Alina,

 

I think you've downloaded a nightly build at some point.  To workaround the pixel bender problem, try copying all .pbj files from the nightly to the same folders in royale-asjs.

 

HTH,

-Alex

 

From: Alina Kazi <[hidden email]>
Reply-To: "[hidden email]" <[hidden email]>
Date: Thursday, March 8, 2018 at 10:42 PM
To: "[hidden email]" <[hidden email]>
Subject: RE: EMULATION

 

Hi Alex,

I am using Apache Ant(TM) version 1.10.1 compiled on February 2 2017 Ant Java Version: 1.8

After Downloading file manually still issue is not resolved.

 

I am reinstalling the operating system Again.

 

Thanks,

Alina

 

From: Alex Harui [[hidden email]]
Sent: Friday, March 09, 2018 10:55 AM
To: [hidden email]
Subject: Re: EMULATION

 

Hi Alina,

 

I'm not sure why you are having problems with the downloads.  Could be your distance from the actual servers or some issue with Ant.  What version of Ant are you running?

 

The mirror.json part is just trying to download this file apache-flex-sdk-pixel-bender-1.0.0-bin.zip into the "in" folder.  Try doing that manually and see if the build goes past that point.

 

Thanks,

-Alex

 

From: Alina Kazi <[hidden email]>
Reply-To: "[hidden email]" <[hidden email]>
Date: Thursday, March 8, 2018 at 9:28 PM
To: "[hidden email]" <[hidden email]>
Subject: RE: EMULATION

 

Hi Alex,

 

 

Fetched all(3) folders from git 2 days earlier , while executing “ant all” or “ant” or “maven …..” Some Errors are occurred.

During the execution of ant all , Auto download wasn’t working So,Downloaded many files manually as the url was present right before the error every time and copying file to folder path that is also mention .

Now getting Error in mirror.json downloading.

https://www.dropbox.com/s/gv9wcvixr9mkcv9/error%20executing%20ant.png?dl=0

 

Thanks,

Alina

 

Reply | Threaded
Open this post in threaded view
|

RE: Royale Build Issue

alina kazi-2
In reply to this post by alina kazi-2

Hi Alex ,

 

https://www.dropbox.com/s/lupr6qsmxe5twwx/royalecompilererror.png?dl=0

Error while executing mvn clean install inside royale-compiler folder.

 

Thanks,

Alina

 

 

From: Alina Kazi [mailto:[hidden email]]
Sent: Thursday, March 15, 2018 11:13 AM
To: [hidden email]
Subject: RE: Royale Build Issue

 

Hi Alex,

 

Yesterday , on another machine , I installed just git, java 1.8.121 and  Apache Maven and added them to environment variable and 
to get the Apache Royale Compiler

git clone https://github.com/apache/royale-compiler.git royale-compiler

 

I just run the command :mvn clean install -P -main,utils inside royale-compiler and It seems working on that machine .

I will get all folders one by one and compile them. If successful, I Will let you know

 

Thanks

Alina

 

From: Alina Kazi [mailto:[hidden email]]
Sent: Thursday, March 15, 2018 9:22 AM
To: [hidden email]
Subject: RE: Royale Build Issue

 

Hi Alex,

 

After Run: ant main

in a D:\prev\prev\royale-typedefs folder

 

Error:

https://www.dropbox.com/s/0rc9exhc66vgh46/error%20ant%20main%20in%20typedefs.txt?dl=0

 

Folder Screenshot:

https://www.dropbox.com/s/a8exa9xp1pmgmp4/typedefs%20folder.png?dl=0

 

I definitely want to learn that how to create Emulation and want to contribute in Apache Royale.

 

Twice I deleted complete files and started from the step 1 and it was : git clone https://github.com/apache/royale-compiler.git royale-compiler
Again I downloaded all dependencies Manually one by one.
Still , I am stuck.
 
 

Thanks,

Alina

 

From: Alex Harui [mailto:[hidden email]]
Sent: Tuesday, March 13, 2018 9:23 PM
To: [hidden email]
Subject: Re: Royale Build Issue

 

Hi Alina, is there a D:\prev\prev\royale-typedefs folder?  If so, run "ant main" in that folder.  If not, it sounds like you have been moving files around.

 

I'm thinking it might be time to "start over" and set your computer up in a different way.  Let me know if you are interested in doing that or would rather just try to make your current setup work.  The advantage of starting over is that you will be able to set up quickly do a full delete and re-build in the future if you are having some other build problem.

 

Thanks,

-Alex

 

From: Alina Kazi <[hidden email]>
Reply-To: "[hidden email]" <[hidden email]>
Date: Tuesday, March 13, 2018 at 3:36 AM
To: "[hidden email]" <[hidden email]>
Subject: RE: Royale Build Issue

 

Hi Alex

 

……

check-typedefs-home:

     [echo] ROYALE_TYPEDEFS_HOME is D:\prev\prev\royale-typedefs

     [echo] basedir is D:\prev\prev\royale-asjs

 

BUILD FAILED

D:\prev\prev\royale-asjs\build.xml:321: ROYALE_TYPEDEFS_HOME must be set to a folder containing js/target/js.swc such as the royale-typedefs repo

 

Total time: 42 seconds

D:\prev\prev\royale-asjs>

 

Environment variables :

 

https://www.dropbox.com/s/zxzvtrzqv834g3q/environment%20variable.png?dl=0

 

Thanks,

Alina

 

From: Alina Kazi [[hidden email]]
Sent: Tuesday, March 13, 2018 2:31 PM
To: [hidden email]
Subject: RE: Royale Build Issue

 

Hi Alex,

Downloaded and then manually downloaded swfobject_2_2 n so on..

When this process of downloading will be completed I will inform you.

 

Reference: https://raw.githubusercontent.com/wiki/apache/royale-asjs/Building-From-Source.md

  Notes :  `ROYALE_TYPEDEFS_HOME` can be used to point the build to a `royale-typedefs` clone in some place other than the default location.

 

 

check-typedefs-home:

     [echo] ROYALE_TYPEDEFS_HOME is ${env.ROYALE_TYPEDEFS_HOME}

     [echo] basedir is D:\prev\prev\royale-asjs

 

BUILD FAILED

D:\prev\prev\royale-asjs\build.xml:321: ROYALE_TYPEDEFS_HOME must be set to a folder containing js/target/js.swc such as the royale-typedefs repo

 

 

Thank you so much.

-Alina

 

 

From: Alex Harui [[hidden email]]
Sent: Tuesday, March 13, 2018 12:29 PM
To: [hidden email]
Subject: Re: Royale Build Issue

 

Hi Alina,

 

This output says you are now failing on flexunit, not pixelbender.

 

Try downloading manually: http://www.apache.org/dyn/mirrors/mirrors.cgi/flex/flexunit/4.2.0/binaries/apache-flex-flexunit-4.2.0-4.12.0-bin.zip

 

Put that zip file in the "in" folder and expand it.  It should create a flexunit folder in "in" so you should have many files one of which is:

 

in/flexunit/flexunit/flexunit-4.2.0-20140410-flex_4.12.0.swc

 

HTH,

-Alex

 

From: Alina Kazi <[hidden email]>
Reply-To: "[hidden email]" <[hidden email]>
Date: Monday, March 12, 2018 at 11:07 PM
To: "[hidden email]" <[hidden email]>
Subject: RE: Royale Build Issue

 

Hi Alex,

 

.pbj files aren’t erased .

Console Output:

https://www.dropbox.com/s/wq3qxdrpdywb25i/error%20ant.txt?dl=0

 

Can you please share all folders in Zip with all dependencies downloaded at my address: [hidden email]

 

 

Thanks,

Alina

 

 

From: Alex Harui [[hidden email]]
Sent: Tuesday, March 13, 2018 11:55 AM
To: [hidden email]
Subject: Re: Royale Build Issue

 

Hi Alina,

 

Please only use d:\prev\prev\royale-asjs for now.  Make sure the .pbj files haven't been erased somehow and run ant again and post the console output.

 

Thanks,

-Alex

 

From: Alina Kazi <[hidden email]>
Reply-To: "[hidden email]" <[hidden email]>
Date: Monday, March 12, 2018 at 10:07 PM
To: "[hidden email]" <[hidden email]>
Subject: RE: Royale Build Issue

 

Hi Alex,

D:\apache royale develop\royale-asjs

D:\apache\ royale-asjs

d:\prev\prev\royale-asjs

all are the folders that I tried on different time currently I have only one of them that is d:\prev\prev\royale-asjs

and I copied all .pbj files into d:\prev\prev\royale-asjs \frameworks/projects/Graphics/src/main/royale/org/apache/royale/graphics/utils/shaderClasses/

 

 

From: Alex Harui [[hidden email]]
Sent: Tuesday, March 13, 2018 11:13 AM
To: [hidden email]
Subject: Re: Royale Build Issue

 

Hi Alina,

 

I can't see the full set of folders in the first dropbox link.

 

In the second, it appears to be listing of d:\prev\prev\royale-asjs

 

However, the console output you posted two posts ago indicates you are running ant in D:\apache royale develop\royale-asjs

 

Please make sure that you are copying .pbj files to the right folders.  I would recommend using folder names without spaces just in case.

 

HTH,

-Alex

 

From: Alina Kazi <[hidden email]>
Reply-To: "[hidden email]" <[hidden email]>
Date: Monday, March 12, 2018 at 9:32 PM
To: "[hidden email]" <[hidden email]>
Subject: RE: Royale Build Issue

 

Hi Alex,

I followed all of your instructions:

https://www.dropbox.com/s/06jti95che7vu4o/pdj%20files%20added.png?dl=0

To verify that I  have copied the .pbj files correctly:

 

dir /s *.pbj

 

https://www.dropbox.com/s/idxdfm5xxm4bb64/pdjfiles.png?dl=0

 

 

If you would like to access my machine. I will share my teamviewer id and password.

 

Thanks,

Alina

 

 

From: Alex Harui [[hidden email]]
Sent: Tuesday, March 13, 2018 10:13 AM
To: [hidden email]
Subject: Re: Royale Build Issue

 

Hi Alina,

 

As I mentioned a couple of posts ago, it is better to copy the .pbj files.  Having the zip in the "in" folder won't prevent the script from trying to download pixel bender.

 

To verify that you have copied the .pbj files correctly, in Windows command prompt do:

 

dir /s *.pbj

 

There should be a set of .pbj files in frameworks/projects/Graphics/src/main/royale/org/apache/royale/graphics/utils/shaderClasses/

 

HTH,

-Alex

 

From: Alina Kazi <[hidden email]>
Reply-To: "[hidden email]" <[hidden email]>
Date: Monday, March 12, 2018 at 8:36 PM
To: "[hidden email]" <[hidden email]>
Subject: RE: Royale Build Issue

 

https://www.dropbox.com/s/gv9wcvixr9mkcv9/error%20executing%20ant.png?dl=0

Even after downloading this file apache-flex-sdk-pixel-bender-1.0.0-bin.zip into the "in" folder.  

 

Thanks ,

Alina

 

From: Alex Harui [[hidden email]]
Sent: Monday, March 12, 2018 9:06 PM
To: [hidden email]
Subject: Re: Royale Build Issue

 

What errors are you getting now?

 

From: Alina Kazi <[hidden email]>
Reply-To: "[hidden email]" <[hidden email]>
Date: Monday, March 12, 2018 at 2:57 AM
To: "[hidden email]" <[hidden email]>
Subject: Royale Build Issue

 

Hi Alex,

 

After windows reinstallation and copying .pbj files.

 

With configuration :

check-playerglobal-home:

     [echo] PLAYERGLOBAL_HOME is D:\playerglobal\player

     [echo] playerglobal.version is 11.1

     [echo] playerglobal.swc is D:\playerglobal\player/11.1/playerglobal.swc

 

check-air-home:

     [echo] AIR_HOME is D:\AdobeAIRSDK\bin

 

check-compiler-home:

     [echo] env.ROYALE_COMPILER_REPO is ${env.ROYALE_COMPILER_REPO}

     [echo] ROYALE_COMPILER_REPO is ${ROYALE_COMPILER_REPO}

     [echo] ROYALE_COMPILER_REPO is d:\Apache\royale-asjs/../royale-compiler

 

check-compile-env:

     [echo] OS: Windows 7 / 6.1 / amd64

     [echo] VM: Java HotSpot(TM) 64-Bit Server VM / 25.31-b07

     [echo] Java: 1.8.0_31

     [echo] Ant: Apache Ant(TM) version 1.10.2 compiled on February 3 2018 Ant Java Version: 1.8

 

And environment variable path:

PATH=C:\Windows\system32;C:\Windows;C:\Windows\System32\Wbem;C:\Windows\System32

\WindowsPowerShell\v1.0;C:\Program Files\Java\jdk1.8.0_31\bin;D:\apache-ant-1.10.2\bin;C:\Program Files\Git\cmd;D:\apache-maven-3.5.3\bin

 

Still getting Errors.

 

Please share git , maven , ant, java version.

 

Thanks,

Alina

____________________________________________________

From: Alex Harui [[hidden email]]
Sent: Friday, March 09, 2018 12:12 PM
To: [hidden email]
Subject: Re: EMULATION

 

Hi Alina,

 

I think you've downloaded a nightly build at some point.  To workaround the pixel bender problem, try copying all .pbj files from the nightly to the same folders in royale-asjs.

 

HTH,

-Alex

 

From: Alina Kazi <[hidden email]>
Reply-To: "[hidden email]" <[hidden email]>
Date: Thursday, March 8, 2018 at 10:42 PM
To: "[hidden email]" <[hidden email]>
Subject: RE: EMULATION

 

Hi Alex,

I am using Apache Ant(TM) version 1.10.1 compiled on February 2 2017 Ant Java Version: 1.8

After Downloading file manually still issue is not resolved.

 

I am reinstalling the operating system Again.

 

Thanks,

Alina

 

From: Alex Harui [[hidden email]]
Sent: Friday, March 09, 2018 10:55 AM
To: [hidden email]
Subject: Re: EMULATION

 

Hi Alina,

 

I'm not sure why you are having problems with the downloads.  Could be your distance from the actual servers or some issue with Ant.  What version of Ant are you running?

 

The mirror.json part is just trying to download this file apache-flex-sdk-pixel-bender-1.0.0-bin.zip into the "in" folder.  Try doing that manually and see if the build goes past that point.

 

Thanks,

-Alex

 

From: Alina Kazi <[hidden email]>
Reply-To: "[hidden email]" <[hidden email]>
Date: Thursday, March 8, 2018 at 9:28 PM
To: "[hidden email]" <[hidden email]>
Subject: RE: EMULATION

 

Hi Alex,

 

 

Fetched all(3) folders from git 2 days earlier , while executing “ant all” or “ant” or “maven …..” Some Errors are occurred.

During the execution of ant all , Auto download wasn’t working So,Downloaded many files manually as the url was present right before the error every time and copying file to folder path that is also mention .

Now getting Error in mirror.json downloading.

https://www.dropbox.com/s/gv9wcvixr9mkcv9/error%20executing%20ant.png?dl=0

 

Thanks,

Alina

 

Reply | Threaded
Open this post in threaded view
|

Re: Royale Build Issue

Piotr Zarzycki
Alina,

That's something you are a bit farther. Try to switch off RAT checking by adding to your command  -Drat.skip=true

Thanks, Piotr

2018-03-15 9:06 GMT+01:00 Alina Kazi <[hidden email]>:

Hi Alex ,

 

https://www.dropbox.com/s/lupr6qsmxe5twwx/royalecompilererror.png?dl=0

Error while executing mvn clean install inside royale-compiler folder.

 

Thanks,

Alina

 

 

From: Alina Kazi [mailto:[hidden email]]
Sent: Thursday, March 15, 2018 11:13 AM
To: [hidden email]


Subject: RE: Royale Build Issue

 

Hi Alex,

 

Yesterday , on another machine , I installed just git, java 1.8.121 and  Apache Maven and added them to environment variable and 
to get the Apache Royale Compiler

git clone https://github.com/apache/royale-compiler.git royale-compiler

 

I just run the command :mvn clean install -P -main,utils inside royale-compiler and It seems working on that machine .

I will get all folders one by one and compile them. If successful, I Will let you know

 

Thanks

Alina

 

From: Alina Kazi [mailto:[hidden email]]
Sent: Thursday, March 15, 2018 9:22 AM
To: [hidden email]
Subject: RE: Royale Build Issue

 

Hi Alex,

 

After Run: ant main

in a D:\prev\prev\royale-typedefs folder

 

Error:

https://www.dropbox.com/s/0rc9exhc66vgh46/error%20ant%20main%20in%20typedefs.txt?dl=0

 

Folder Screenshot:

https://www.dropbox.com/s/a8exa9xp1pmgmp4/typedefs%20folder.png?dl=0

 

I definitely want to learn that how to create Emulation and want to contribute in Apache Royale.

 

Twice I deleted complete files and started from the step 1 and it was : git clone https://github.com/apache/royale-compiler.git royale-compiler
Again I downloaded all dependencies Manually one by one.
Still , I am stuck.
 
 

Thanks,

Alina

 

From: Alex Harui [mailto:[hidden email]]
Sent: Tuesday, March 13, 2018 9:23 PM
To: [hidden email]
Subject: Re: Royale Build Issue

 

Hi Alina, is there a D:\prev\prev\royale-typedefs folder?  If so, run "ant main" in that folder.  If not, it sounds like you have been moving files around.

 

I'm thinking it might be time to "start over" and set your computer up in a different way.  Let me know if you are interested in doing that or would rather just try to make your current setup work.  The advantage of starting over is that you will be able to set up quickly do a full delete and re-build in the future if you are having some other build problem.

 

Thanks,

-Alex

 

From: Alina Kazi <[hidden email]>
Reply-To: "[hidden email]" <[hidden email]>
Date: Tuesday, March 13, 2018 at 3:36 AM
To: "[hidden email]" <[hidden email]>
Subject: RE: Royale Build Issue

 

Hi Alex

 

……

check-typedefs-home:

     [echo] ROYALE_TYPEDEFS_HOME is D:\prev\prev\royale-typedefs

     [echo] basedir is D:\prev\prev\royale-asjs

 

BUILD FAILED

D:\prev\prev\royale-asjs\build.xml:321: ROYALE_TYPEDEFS_HOME must be set to a folder containing js/target/js.swc such as the royale-typedefs repo

 

Total time: 42 seconds

D:\prev\prev\royale-asjs>

 

Environment variables :

 

https://www.dropbox.com/s/zxzvtrzqv834g3q/environment%20variable.png?dl=0

 

Thanks,

Alina

 

From: Alina Kazi [[hidden email]]
Sent: Tuesday, March 13, 2018 2:31 PM
To: [hidden email]
Subject: RE: Royale Build Issue

 

Hi Alex,

Downloaded and then manually downloaded swfobject_2_2 n so on..

When this process of downloading will be completed I will inform you.

 

Reference: https://raw.githubusercontent.com/wiki/apache/royale-asjs/Building-From-Source.md

  Notes :  `ROYALE_TYPEDEFS_HOME` can be used to point the build to a `royale-typedefs` clone in some place other than the default location.

 

 

check-typedefs-home:

     [echo] ROYALE_TYPEDEFS_HOME is ${env.ROYALE_TYPEDEFS_HOME}

     [echo] basedir is D:\prev\prev\royale-asjs

 

BUILD FAILED

D:\prev\prev\royale-asjs\build.xml:321: ROYALE_TYPEDEFS_HOME must be set to a folder containing js/target/js.swc such as the royale-typedefs repo

 

 

Thank you so much.

-Alina

 

 

From: Alex Harui [[hidden email]]
Sent: Tuesday, March 13, 2018 12:29 PM
To: [hidden email]
Subject: Re: Royale Build Issue

 

Hi Alina,

 

This output says you are now failing on flexunit, not pixelbender.

 

Try downloading manually: http://www.apache.org/dyn/mirrors/mirrors.cgi/flex/flexunit/4.2.0/binaries/apache-flex-flexunit-4.2.0-4.12.0-bin.zip

 

Put that zip file in the "in" folder and expand it.  It should create a flexunit folder in "in" so you should have many files one of which is:

 

in/flexunit/flexunit/flexunit-4.2.0-20140410-flex_4.12.0.swc

 

HTH,

-Alex

 

From: Alina Kazi <[hidden email]>
Reply-To: "[hidden email]" <[hidden email]>
Date: Monday, March 12, 2018 at 11:07 PM
To: "[hidden email]" <[hidden email]>
Subject: RE: Royale Build Issue

 

Hi Alex,

 

.pbj files aren’t erased .

Console Output:

https://www.dropbox.com/s/wq3qxdrpdywb25i/error%20ant.txt?dl=0

 

Can you please share all folders in Zip with all dependencies downloaded at my address: [hidden email]

 

 

Thanks,

Alina

 

 

From: Alex Harui [[hidden email]]
Sent: Tuesday, March 13, 2018 11:55 AM
To: [hidden email]
Subject: Re: Royale Build Issue

 

Hi Alina,

 

Please only use d:\prev\prev\royale-asjs for now.  Make sure the .pbj files haven't been erased somehow and run ant again and post the console output.

 

Thanks,

-Alex

 

From: Alina Kazi <[hidden email]>
Reply-To: "[hidden email]" <[hidden email]>
Date: Monday, March 12, 2018 at 10:07 PM
To: "[hidden email]" <[hidden email]>
Subject: RE: Royale Build Issue

 

Hi Alex,

D:\apache royale develop\royale-asjs

D:\apache\ royale-asjs

d:\prev\prev\royale-asjs

all are the folders that I tried on different time currently I have only one of them that is d:\prev\prev\royale-asjs

and I copied all .pbj files into d:\prev\prev\royale-asjs \frameworks/projects/Graphics/src/main/royale/org/apache/royale/graphics/utils/shaderClasses/

 

 

From: Alex Harui [[hidden email]]
Sent: Tuesday, March 13, 2018 11:13 AM
To: [hidden email]
Subject: Re: Royale Build Issue

 

Hi Alina,

 

I can't see the full set of folders in the first dropbox link.

 

In the second, it appears to be listing of d:\prev\prev\royale-asjs

 

However, the console output you posted two posts ago indicates you are running ant in D:\apache royale develop\royale-asjs

 

Please make sure that you are copying .pbj files to the right folders.  I would recommend using folder names without spaces just in case.

 

HTH,

-Alex

 

From: Alina Kazi <[hidden email]>
Reply-To: "[hidden email]" <[hidden email]>
Date: Monday, March 12, 2018 at 9:32 PM
To: "[hidden email]" <[hidden email]>
Subject: RE: Royale Build Issue

 

Hi Alex,

I followed all of your instructions:

https://www.dropbox.com/s/06jti95che7vu4o/pdj%20files%20added.png?dl=0

To verify that I  have copied the .pbj files correctly:

 

dir /s *.pbj

 

https://www.dropbox.com/s/idxdfm5xxm4bb64/pdjfiles.png?dl=0

 

 

If you would like to access my machine. I will share my teamviewer id and password.

 

Thanks,

Alina

 

 

From: Alex Harui [[hidden email]]
Sent: Tuesday, March 13, 2018 10:13 AM
To: [hidden email]
Subject: Re: Royale Build Issue

 

Hi Alina,

 

As I mentioned a couple of posts ago, it is better to copy the .pbj files.  Having the zip in the "in" folder won't prevent the script from trying to download pixel bender.

 

To verify that you have copied the .pbj files correctly, in Windows command prompt do:

 

dir /s *.pbj

 

There should be a set of .pbj files in frameworks/projects/Graphics/src/main/royale/org/apache/royale/graphics/utils/shaderClasses/

 

HTH,

-Alex

 

From: Alina Kazi <[hidden email]>
Reply-To: "[hidden email]" <[hidden email]>
Date: Monday, March 12, 2018 at 8:36 PM
To: "[hidden email]" <[hidden email]>
Subject: RE: Royale Build Issue

 

https://www.dropbox.com/s/gv9wcvixr9mkcv9/error%20executing%20ant.png?dl=0

Even after downloading this file apache-flex-sdk-pixel-bender-1.0.0-bin.zip into the "in" folder.  

 

Thanks ,

Alina

 

From: Alex Harui [[hidden email]]
Sent: Monday, March 12, 2018 9:06 PM
To: [hidden email]
Subject: Re: Royale Build Issue

 

What errors are you getting now?

 

From: Alina Kazi <[hidden email]>
Reply-To: "[hidden email]" <[hidden email]>
Date: Monday, March 12, 2018 at 2:57 AM
To: "[hidden email]" <[hidden email]>
Subject: Royale Build Issue

 

Hi Alex,

 

After windows reinstallation and copying .pbj files.

 

With configuration :

check-playerglobal-home:

     [echo] PLAYERGLOBAL_HOME is D:\playerglobal\player

     [echo] playerglobal.version is 11.1

     [echo] playerglobal.swc is D:\playerglobal\player/11.1/playerglobal.swc

 

check-air-home:

     [echo] AIR_HOME is D:\AdobeAIRSDK\bin

 

check-compiler-home:

     [echo] env.ROYALE_COMPILER_REPO is ${env.ROYALE_COMPILER_REPO}

     [echo] ROYALE_COMPILER_REPO is ${ROYALE_COMPILER_REPO}

     [echo] ROYALE_COMPILER_REPO is d:\Apache\royale-asjs/../royale-compiler

 

check-compile-env:

     [echo] OS: Windows 7 / 6.1 / amd64

     [echo] VM: Java HotSpot(TM) 64-Bit Server VM / 25.31-b07

     [echo] Java: 1.8.0_31

     [echo] Ant: Apache Ant(TM) version 1.10.2 compiled on February 3 2018 Ant Java Version: 1.8

 

And environment variable path:

PATH=C:\Windows\system32;C:\Windows;C:\Windows\System32\Wbem;C:\Windows\System32

\WindowsPowerShell\v1.0;C:\Program Files\Java\jdk1.8.0_31\bin;D:\apache-ant-1.10.2\bin;C:\Program Files\Git\cmd;D:\apache-maven-3.5.3\bin

 

Still getting Errors.

 

Please share git , maven , ant, java version.

 

Thanks,

Alina

____________________________________________________

From: Alex Harui [[hidden email]]
Sent: Friday, March 09, 2018 12:12 PM
To: [hidden email]
Subject: Re: EMULATION

 

Hi Alina,

 

I think you've downloaded a nightly build at some point.  To workaround the pixel bender problem, try copying all .pbj files from the nightly to the same folders in royale-asjs.

 

HTH,

-Alex

 

From: Alina Kazi <[hidden email]>
Reply-To: "[hidden email]" <[hidden email]>
Date: Thursday, March 8, 2018 at 10:42 PM
To: "[hidden email]" <[hidden email]>
Subject: RE: EMULATION

 

Hi Alex,

I am using Apache Ant(TM) version 1.10.1 compiled on February 2 2017 Ant Java Version: 1.8

After Downloading file manually still issue is not resolved.

 

I am reinstalling the operating system Again.

 

Thanks,

Alina

 

From: Alex Harui [[hidden email]]
Sent: Friday, March 09, 2018 10:55 AM
To: [hidden email]
Subject: Re: EMULATION

 

Hi Alina,

 

I'm not sure why you are having problems with the downloads.  Could be your distance from the actual servers or some issue with Ant.  What version of Ant are you running?

 

The mirror.json part is just trying to download this file apache-flex-sdk-pixel-bender-1.0.0-bin.zip into the "in" folder.  Try doing that manually and see if the build goes past that point.

 

Thanks,

-Alex

 

From: Alina Kazi <[hidden email]>
Reply-To: "[hidden email]" <[hidden email]>
Date: Thursday, March 8, 2018 at 9:28 PM
To: "[hidden email]" <[hidden email]>
Subject: RE: EMULATION

 

Hi Alex,

 

 

Fetched all(3) folders from git 2 days earlier , while executing “ant all” or “ant” or “maven …..” Some Errors are occurred.

During the execution of ant all , Auto download wasn’t working So,Downloaded many files manually as the url was present right before the error every time and copying file to folder path that is also mention .

Now getting Error in mirror.json downloading.

https://www.dropbox.com/s/gv9wcvixr9mkcv9/error%20executing%20ant.png?dl=0

 

Thanks,

Alina

 




--

Piotr Zarzycki 

Patreon: https://www.patreon.com/piotrzarzycki

Reply | Threaded
Open this post in threaded view
|

RE: Royale Build Issue

alina kazi-2

Hi Piotr,

 

https://www.dropbox.com/s/aj1qehblok9yhfw/error.txt?dl=0

During the execution of:

mvn install -Drat.skip=true inside royale-compiler

 

Thanks,

Alina

From: Piotr Zarzycki [mailto:[hidden email]]
Sent: Thursday, March 15, 2018 1:12 PM
To: [hidden email]
Subject: Re: Royale Build Issue

 

Alina,

 

That's something you are a bit farther. Try to switch off RAT checking by adding to your command  -Drat.skip=true

 

Thanks, Piotr

 

2018-03-15 9:06 GMT+01:00 Alina Kazi <[hidden email]>:

Hi Alex ,

 

https://www.dropbox.com/s/lupr6qsmxe5twwx/royalecompilererror.png?dl=0

Error while executing mvn clean install inside royale-compiler folder.

 

Thanks,

Alina

 

 

From: Alina Kazi [mailto:[hidden email]]
Sent: Thursday, March 15, 2018 11:13 AM
To: [hidden email]


Subject: RE: Royale Build Issue

 

Hi Alex,

 

Yesterday , on another machine , I installed just git, java 1.8.121 and  Apache Maven and added them to environment variable and 
to get the Apache Royale Compiler

git clone https://github.com/apache/royale-compiler.git royale-compiler

 

I just run the command :mvn clean install -P -main,utils inside royale-compiler and It seems working on that machine .

I will get all folders one by one and compile them. If successful, I Will let you know

 

Thanks

Alina

 

From: Alina Kazi [mailto:[hidden email]]
Sent: Thursday, March 15, 2018 9:22 AM
To: [hidden email]
Subject: RE: Royale Build Issue

 

Hi Alex,

 

After Run: ant main

in a D:\prev\prev\royale-typedefs folder

 

Error:

https://www.dropbox.com/s/0rc9exhc66vgh46/error%20ant%20main%20in%20typedefs.txt?dl=0

 

Folder Screenshot:

https://www.dropbox.com/s/a8exa9xp1pmgmp4/typedefs%20folder.png?dl=0

 

I definitely want to learn that how to create Emulation and want to contribute in Apache Royale.

 

Twice I deleted complete files and started from the step 1 and it was : git clone https://github.com/apache/royale-compiler.git royale-compiler
Again I downloaded all dependencies Manually one by one.
Still , I am stuck.
 
 

Thanks,

Alina

 

From: Alex Harui [mailto:[hidden email]]
Sent: Tuesday, March 13, 2018 9:23 PM
To: [hidden email]
Subject: Re: Royale Build Issue

 

Hi Alina, is there a D:\prev\prev\royale-typedefs folder?  If so, run "ant main" in that folder.  If not, it sounds like you have been moving files around.

 

I'm thinking it might be time to "start over" and set your computer up in a different way.  Let me know if you are interested in doing that or would rather just try to make your current setup work.  The advantage of starting over is that you will be able to set up quickly do a full delete and re-build in the future if you are having some other build problem.

 

Thanks,

-Alex

 

From: Alina Kazi <[hidden email]>
Reply-To: "[hidden email]" <[hidden email]>
Date: Tuesday, March 13, 2018 at 3:36 AM
To: "[hidden email]" <[hidden email]>
Subject: RE: Royale Build Issue

 

Hi Alex

 

……

check-typedefs-home:

     [echo] ROYALE_TYPEDEFS_HOME is D:\prev\prev\royale-typedefs

     [echo] basedir is D:\prev\prev\royale-asjs

 

BUILD FAILED

D:\prev\prev\royale-asjs\build.xml:321: ROYALE_TYPEDEFS_HOME must be set to a folder containing js/target/js.swc such as the royale-typedefs repo

 

Total time: 42 seconds

D:\prev\prev\royale-asjs>

 

Environment variables :

 

https://www.dropbox.com/s/zxzvtrzqv834g3q/environment%20variable.png?dl=0

 

Thanks,

Alina

 

From: Alina Kazi [[hidden email]]
Sent: Tuesday, March 13, 2018 2:31 PM
To: [hidden email]
Subject: RE: Royale Build Issue

 

Hi Alex,

Downloaded and then manually downloaded swfobject_2_2 n so on..

When this process of downloading will be completed I will inform you.

 

Reference: https://raw.githubusercontent.com/wiki/apache/royale-asjs/Building-From-Source.md

  Notes :  `ROYALE_TYPEDEFS_HOME` can be used to point the build to a `royale-typedefs` clone in some place other than the default location.

 

 

check-typedefs-home:

     [echo] ROYALE_TYPEDEFS_HOME is ${env.ROYALE_TYPEDEFS_HOME}

     [echo] basedir is D:\prev\prev\royale-asjs

 

BUILD FAILED

D:\prev\prev\royale-asjs\build.xml:321: ROYALE_TYPEDEFS_HOME must be set to a folder containing js/target/js.swc such as the royale-typedefs repo

 

 

Thank you so much.

-Alina