compiler build failed...

classic Classic list List threaded Threaded
5 messages Options
Reply | Threaded
Open this post in threaded view
|

compiler build failed...

Serkan Taş
BUILD FAILED
D:\dev\royale-emulation-works\github\royale-compiler\build.xml:108: The following error occurred while executing this line:
D:\dev\royale-emulation-works\github\royale-compiler\compiler-jx\build.xml:171: The following error occurred while executing this line:
D:\dev\royale-emulation-works\github\royale-compiler\compiler-jx\src\test\build.xml:92: Tests failed
Reply | Threaded
Open this post in threaded view
|

Re: compiler build failed...

Alex Harui-2

Which tests failed?

 

From: Serkan Taş <[hidden email]>
Reply-To: "[hidden email]" <[hidden email]>
Date: Wednesday, February 26, 2020 at 10:41 AM
To: "[hidden email]" <[hidden email]>
Subject: compiler build failed...

 

BUILD FAILED
D:\dev\royale-emulation-works\github\royale-compiler\build.xml:108: The following error occurred while executing this line:
D:\dev\royale-emulation-works\github\royale-compiler\compiler-jx\build.xml:171: The following error occurred while executing this line:
D:\dev\royale-emulation-works\github\royale-compiler\compiler-jx\src\test\build.xml:92: Tests failed

Reply | Threaded
Open this post in threaded view
|

Re: compiler build failed...

Serkan Taş
Not sure....

Full output  : https://drive.google.com/open?id=1_6-rBQqTISbeoLvS2-yV8bSFkvS_ApxZ


26.02.2020 22:03 tarihinde Alex Harui yazdı:

Which tests failed?

 

From: Serkan Taş [hidden email]
Reply-To: [hidden email] [hidden email]
Date: Wednesday, February 26, 2020 at 10:41 AM
To: [hidden email] [hidden email]
Subject: compiler build failed...

 

BUILD FAILED
D:\dev\royale-emulation-works\github\royale-compiler\build.xml:108: The following error occurred while executing this line:
D:\dev\royale-emulation-works\github\royale-compiler\compiler-jx\build.xml:171: The following error occurred while executing this line:
D:\dev\royale-emulation-works\github\royale-compiler\compiler-jx\src\test\build.xml:92: Tests failed


Reply | Threaded
Open this post in threaded view
|

Re: compiler build failed...

Alex Harui-2

OK, thanks for finding that.  Should be fixed now.

 

-Alex

 

From: Serkan Taş <[hidden email]>
Date: Wednesday, February 26, 2020 at 11:14 AM
To: "[hidden email]" <[hidden email]>, Alex Harui <[hidden email]>
Subject: Re: compiler build failed...

 

Not sure....

Full output  : https://drive.google.com/open?id=1_6-rBQqTISbeoLvS2-yV8bSFkvS_ApxZ

26.02.2020 22:03 tarihinde Alex Harui yazdı:

Which tests failed?

 

From: Serkan Taş [hidden email]
Reply-To: [hidden email] [hidden email]
Date: Wednesday, February 26, 2020 at 10:41 AM
To: [hidden email] [hidden email]
Subject: compiler build failed...

 

BUILD FAILED
D:\dev\royale-emulation-works\github\royale-compiler\build.xml:108: The following error occurred while executing this line:
D:\dev\royale-emulation-works\github\royale-compiler\compiler-jx\build.xml:171: The following error occurred while executing this line:
D:\dev\royale-emulation-works\github\royale-compiler\compiler-jx\src\test\build.xml:92: Tests failed



Reply | Threaded
Open this post in threaded view
|

Re: compiler build failed...

Serkan Taş
Your welcome Alex, it looks like fixed.
Serkan

26.02.2020 22:36 tarihinde Alex Harui yazdı:

OK, thanks for finding that.  Should be fixed now.

 

-Alex

 

From: Serkan Taş [hidden email]
Date: Wednesday, February 26, 2020 at 11:14 AM
To: [hidden email] [hidden email], Alex Harui [hidden email]
Subject: Re: compiler build failed...

 

Not sure....

Full output  : https://drive.google.com/open?id=1_6-rBQqTISbeoLvS2-yV8bSFkvS_ApxZ

26.02.2020 22:03 tarihinde Alex Harui yazdı:

Which tests failed?

 

From: Serkan Taş [hidden email]
Reply-To: [hidden email] [hidden email]
Date: Wednesday, February 26, 2020 at 10:41 AM
To: [hidden email] [hidden email]
Subject: compiler build failed...

 

BUILD FAILED
D:\dev\royale-emulation-works\github\royale-compiler\build.xml:108: The following error occurred while executing this line:
D:\dev\royale-emulation-works\github\royale-compiler\compiler-jx\build.xml:171: The following error occurred while executing this line:
D:\dev\royale-emulation-works\github\royale-compiler\compiler-jx\src\test\build.xml:92: Tests failed