compiler is broken

classic Classic list List threaded Threaded
21 messages Options
12
Reply | Threaded
Open this post in threaded view
|

compiler is broken

Serkan Taş
Hi,

When compiling royale I am getting error below. Any one has idea ?

Here is the end of the log :

get-from-cache-if-needed:
    [unzip] Expanding: D:\dev\royale-emulation-works\github\royale-asjs\in\apache-flex-flexunit-4.2.0-4.12.0-bin.zip into D:\dev\royale-emulation-works\github\royale-asjs\in\flexunit

BUILD FAILED
D:\dev\royale-emulation-works\github\royale-asjs\build.xml:193: The following error occurred while executing this line:
D:\dev\royale-emulation-works\github\royale-asjs\frameworks\build.xml:106: The following error occurred while executing this line:
D:\dev\royale-emulation-works\github\royale-asjs\frameworks\downloads.xml:110: Error while expanding D:\dev\royale-emulation-works\github\royale-asjs\in\apache-flex-flexunit-4.2.0-4.12.0-bin.zip
java.util.zip.ZipException: archive is not a ZIP archive
        at org.apache.tools.zip.ZipFile.positionAtEndOfCentralDirectoryRecord(ZipFile.java:775)
        at org.apache.tools.zip.ZipFile.positionAtCentralDirectory(ZipFile.java:711)
        at org.apache.tools.zip.ZipFile.populateFromCentralDirectory(ZipFile.java:456)
        at org.apache.tools.zip.ZipFile.<init>(ZipFile.java:216)
        at org.apache.tools.ant.taskdefs.Expand.expandFile(Expand.java:190)
        at org.apache.tools.ant.taskdefs.Expand.execute(Expand.java:157)
        at org.apache.tools.ant.UnknownElement.execute(UnknownElement.java:292)
        at sun.reflect.GeneratedMethodAccessor4.invoke(Unknown Source)
        at sun.reflect.DelegatingMethodAccessorImpl.invoke(DelegatingMethodAccessorImpl.java:43)
        at java.lang.reflect.Method.invoke(Method.java:498)
        at org.apache.tools.ant.dispatch.DispatchUtils.execute(DispatchUtils.java:99)
        at org.apache.tools.ant.Task.perform(Task.java:350)
        at org.apache.tools.ant.Target.execute(Target.java:449)
        at org.apache.tools.ant.Target.performTasks(Target.java:470)
        at org.apache.tools.ant.Project.executeSortedTargets(Project.java:1388)
        at org.apache.tools.ant.helper.SingleCheckExecutor.executeTargets(SingleCheckExecutor.java:36)
        at org.apache.tools.ant.Project.executeTargets(Project.java:1251)
        at org.apache.tools.ant.taskdefs.Ant.execute(Ant.java:437)
        at org.apache.tools.ant.UnknownElement.execute(UnknownElement.java:292)
        at sun.reflect.GeneratedMethodAccessor4.invoke(Unknown Source)
        at sun.reflect.DelegatingMethodAccessorImpl.invoke(DelegatingMethodAccessorImpl.java:43)
        at java.lang.reflect.Method.invoke(Method.java:498)
        at org.apache.tools.ant.dispatch.DispatchUtils.execute(DispatchUtils.java:99)
        at org.apache.tools.ant.Task.perform(Task.java:350)
        at org.apache.tools.ant.Target.execute(Target.java:449)
        at org.apache.tools.ant.Target.performTasks(Target.java:470)
        at org.apache.tools.ant.Project.executeSortedTargets(Project.java:1388)
        at org.apache.tools.ant.helper.SingleCheckExecutor.executeTargets(SingleCheckExecutor.java:36)
        at org.apache.tools.ant.Project.executeTargets(Project.java:1251)
        at org.apache.tools.ant.taskdefs.Ant.execute(Ant.java:437)
        at org.apache.tools.ant.UnknownElement.execute(UnknownElement.java:292)
        at sun.reflect.GeneratedMethodAccessor4.invoke(Unknown Source)
        at sun.reflect.DelegatingMethodAccessorImpl.invoke(DelegatingMethodAccessorImpl.java:43)
        at java.lang.reflect.Method.invoke(Method.java:498)
        at org.apache.tools.ant.dispatch.DispatchUtils.execute(DispatchUtils.java:99)
        at org.apache.tools.ant.Task.perform(Task.java:350)
        at org.apache.tools.ant.Target.execute(Target.java:449)
        at org.apache.tools.ant.Target.performTasks(Target.java:470)
        at org.apache.tools.ant.Project.executeSortedTargets(Project.java:1388)
        at org.apache.tools.ant.Project.executeTarget(Project.java:1361)
        at org.apache.tools.ant.helper.DefaultExecutor.executeTargets(DefaultExecutor.java:41)
        at org.apache.tools.ant.Project.executeTargets(Project.java:1251)
        at org.apache.tools.ant.Main.runBuild(Main.java:834)
        at org.apache.tools.ant.Main.startAnt(Main.java:223)
        at org.apache.tools.ant.launch.Launcher.run(Launcher.java:284)
        at org.apache.tools.ant.launch.Launcher.main(Launcher.java:101)

Total time: 3 minutes 44 seconds


Thanks,
Serkan

Reply | Threaded
Open this post in threaded view
|

Re: compiler is broken

Alex Harui-2

Hi Serkan,

 

I don’t think that has anything to do with the compiler.  FlexUnit is for ActionScript unit tests.  I suggest that you clear your browser cache.  Sometimes the download libraries use browser libraries and a bad version of a file will be in a browser cache.

 

HTH,

-Alex

 

From: Serkan Taş <[hidden email]>
Reply-To: "[hidden email]" <[hidden email]>
Date: Tuesday, December 11, 2018 at 11:05 AM
To: "[hidden email]" <[hidden email]>
Subject: compiler is broken

 

Hi,

When compiling royale I am getting error below. Any one has idea ?

Here is the end of the log :

get-from-cache-if-needed:
    [unzip] Expanding: D:\dev\royale-emulation-works\github\royale-asjs\in\apache-flex-flexunit-4.2.0-4.12.0-bin.zip into D:\dev\royale-emulation-works\github\royale-asjs\in\flexunit

BUILD FAILED
D:\dev\royale-emulation-works\github\royale-asjs\build.xml:193: The following error occurred while executing this line:
D:\dev\royale-emulation-works\github\royale-asjs\frameworks\build.xml:106: The following error occurred while executing this line:
D:\dev\royale-emulation-works\github\royale-asjs\frameworks\downloads.xml:110: Error while expanding D:\dev\royale-emulation-works\github\royale-asjs\in\apache-flex-flexunit-4.2.0-4.12.0-bin.zip
java.util.zip.ZipException: archive is not a ZIP archive
        at org.apache.tools.zip.ZipFile.positionAtEndOfCentralDirectoryRecord(ZipFile.java:775)
        at org.apache.tools.zip.ZipFile.positionAtCentralDirectory(ZipFile.java:711)
        at org.apache.tools.zip.ZipFile.populateFromCentralDirectory(ZipFile.java:456)
        at org.apache.tools.zip.ZipFile.<init>(ZipFile.java:216)
        at org.apache.tools.ant.taskdefs.Expand.expandFile(Expand.java:190)
        at org.apache.tools.ant.taskdefs.Expand.execute(Expand.java:157)
        at org.apache.tools.ant.UnknownElement.execute(UnknownElement.java:292)
        at sun.reflect.GeneratedMethodAccessor4.invoke(Unknown Source)
        at sun.reflect.DelegatingMethodAccessorImpl.invoke(DelegatingMethodAccessorImpl.java:43)
        at java.lang.reflect.Method.invoke(Method.java:498)
        at org.apache.tools.ant.dispatch.DispatchUtils.execute(DispatchUtils.java:99)
        at org.apache.tools.ant.Task.perform(Task.java:350)
        at org.apache.tools.ant.Target.execute(Target.java:449)
        at org.apache.tools.ant.Target.performTasks(Target.java:470)
        at org.apache.tools.ant.Project.executeSortedTargets(Project.java:1388)
        at org.apache.tools.ant.helper.SingleCheckExecutor.executeTargets(SingleCheckExecutor.java:36)
        at org.apache.tools.ant.Project.executeTargets(Project.java:1251)
        at org.apache.tools.ant.taskdefs.Ant.execute(Ant.java:437)
        at org.apache.tools.ant.UnknownElement.execute(UnknownElement.java:292)
        at sun.reflect.GeneratedMethodAccessor4.invoke(Unknown Source)
        at sun.reflect.DelegatingMethodAccessorImpl.invoke(DelegatingMethodAccessorImpl.java:43)
        at java.lang.reflect.Method.invoke(Method.java:498)
        at org.apache.tools.ant.dispatch.DispatchUtils.execute(DispatchUtils.java:99)
        at org.apache.tools.ant.Task.perform(Task.java:350)
        at org.apache.tools.ant.Target.execute(Target.java:449)
        at org.apache.tools.ant.Target.performTasks(Target.java:470)
        at org.apache.tools.ant.Project.executeSortedTargets(Project.java:1388)
        at org.apache.tools.ant.helper.SingleCheckExecutor.executeTargets(SingleCheckExecutor.java:36)
        at org.apache.tools.ant.Project.executeTargets(Project.java:1251)
        at org.apache.tools.ant.taskdefs.Ant.execute(Ant.java:437)
        at org.apache.tools.ant.UnknownElement.execute(UnknownElement.java:292)
        at sun.reflect.GeneratedMethodAccessor4.invoke(Unknown Source)
        at sun.reflect.DelegatingMethodAccessorImpl.invoke(DelegatingMethodAccessorImpl.java:43)
        at java.lang.reflect.Method.invoke(Method.java:498)
        at org.apache.tools.ant.dispatch.DispatchUtils.execute(DispatchUtils.java:99)
        at org.apache.tools.ant.Task.perform(Task.java:350)
        at org.apache.tools.ant.Target.execute(Target.java:449)
        at org.apache.tools.ant.Target.performTasks(Target.java:470)
        at org.apache.tools.ant.Project.executeSortedTargets(Project.java:1388)
        at org.apache.tools.ant.Project.executeTarget(Project.java:1361)
        at org.apache.tools.ant.helper.DefaultExecutor.executeTargets(DefaultExecutor.java:41)
        at org.apache.tools.ant.Project.executeTargets(Project.java:1251)
        at org.apache.tools.ant.Main.runBuild(Main.java:834)
        at org.apache.tools.ant.Main.startAnt(Main.java:223)
        at org.apache.tools.ant.launch.Launcher.run(Launcher.java:284)
        at org.apache.tools.ant.launch.Launcher.main(Launcher.java:101)

Total time: 3 minutes 44 seconds


Thanks,
Serkan

Reply | Threaded
Open this post in threaded view
|

Re: compiler is broken

Serkan Taş
Hi Alex,

Which browser cache should be cleaned ?

Here is the download command from log :

download_using_mirror:
      [get] Getting: http://www.apache.org/dyn/mirrors/mirrors.cgi/flex/flexunit/4.2.0/binaries/apache-flex-flexunit-4.2.0-4.12.0-bin.zip?asjson=true
      [get] To: D:\dev\royale-emulation-works\github\royale-asjs\frameworks\mirror.json
      [get] .

check_mirror_json:

use_mirror:
   [delete] Deleting: D:\dev\royale-emulation-works\github\royale-asjs\frameworks\mirror.json
     [echo] Using mirror: http://ftp.itu.edu.tr/Mirror/Apache/
      [get] Getting: http://ftp.itu.edu.tr/Mirror/Apache/flex/flexunit/4.2.0/binaries/apache-flex-flexunit-4.2.0-4.12.0-bin.zip
      [get] To: D:\dev\royale-emulation-works\github\royale-asjs\in\apache-flex-flexunit-4.2.0-4.12.0-bin.zip




And full log for reference : https://drive.google.com/open?id=14rWYkD--Dv89nw8H1lJ1Dymg4IQVznKg

Thanks,
Serkan

11.12.2018 22:09 tarihinde Alex Harui yazdı:

Hi Serkan,

 

I don’t think that has anything to do with the compiler.  FlexUnit is for ActionScript unit tests.  I suggest that you clear your browser cache.  Sometimes the download libraries use browser libraries and a bad version of a file will be in a browser cache.

 

HTH,

-Alex

 

From: Serkan Taş [hidden email]
Reply-To: [hidden email] [hidden email]
Date: Tuesday, December 11, 2018 at 11:05 AM
To: [hidden email] [hidden email]
Subject: compiler is broken

 

Hi,

When compiling royale I am getting error below. Any one has idea ?

Here is the end of the log :

get-from-cache-if-needed:
    [unzip] Expanding: D:\dev\royale-emulation-works\github\royale-asjs\in\apache-flex-flexunit-4.2.0-4.12.0-bin.zip into D:\dev\royale-emulation-works\github\royale-asjs\in\flexunit

BUILD FAILED
D:\dev\royale-emulation-works\github\royale-asjs\build.xml:193: The following error occurred while executing this line:
D:\dev\royale-emulation-works\github\royale-asjs\frameworks\build.xml:106: The following error occurred while executing this line:
D:\dev\royale-emulation-works\github\royale-asjs\frameworks\downloads.xml:110: Error while expanding D:\dev\royale-emulation-works\github\royale-asjs\in\apache-flex-flexunit-4.2.0-4.12.0-bin.zip
java.util.zip.ZipException: archive is not a ZIP archive
        at org.apache.tools.zip.ZipFile.positionAtEndOfCentralDirectoryRecord(ZipFile.java:775)
        at org.apache.tools.zip.ZipFile.positionAtCentralDirectory(ZipFile.java:711)
        at org.apache.tools.zip.ZipFile.populateFromCentralDirectory(ZipFile.java:456)
        at org.apache.tools.zip.ZipFile.<init>(ZipFile.java:216)
        at org.apache.tools.ant.taskdefs.Expand.expandFile(Expand.java:190)
        at org.apache.tools.ant.taskdefs.Expand.execute(Expand.java:157)
        at org.apache.tools.ant.UnknownElement.execute(UnknownElement.java:292)
        at sun.reflect.GeneratedMethodAccessor4.invoke(Unknown Source)
        at sun.reflect.DelegatingMethodAccessorImpl.invoke(DelegatingMethodAccessorImpl.java:43)
        at java.lang.reflect.Method.invoke(Method.java:498)
        at org.apache.tools.ant.dispatch.DispatchUtils.execute(DispatchUtils.java:99)
        at org.apache.tools.ant.Task.perform(Task.java:350)
        at org.apache.tools.ant.Target.execute(Target.java:449)
        at org.apache.tools.ant.Target.performTasks(Target.java:470)
        at org.apache.tools.ant.Project.executeSortedTargets(Project.java:1388)
        at org.apache.tools.ant.helper.SingleCheckExecutor.executeTargets(SingleCheckExecutor.java:36)
        at org.apache.tools.ant.Project.executeTargets(Project.java:1251)
        at org.apache.tools.ant.taskdefs.Ant.execute(Ant.java:437)
        at org.apache.tools.ant.UnknownElement.execute(UnknownElement.java:292)
        at sun.reflect.GeneratedMethodAccessor4.invoke(Unknown Source)
        at sun.reflect.DelegatingMethodAccessorImpl.invoke(DelegatingMethodAccessorImpl.java:43)
        at java.lang.reflect.Method.invoke(Method.java:498)
        at org.apache.tools.ant.dispatch.DispatchUtils.execute(DispatchUtils.java:99)
        at org.apache.tools.ant.Task.perform(Task.java:350)
        at org.apache.tools.ant.Target.execute(Target.java:449)
        at org.apache.tools.ant.Target.performTasks(Target.java:470)
        at org.apache.tools.ant.Project.executeSortedTargets(Project.java:1388)
        at org.apache.tools.ant.helper.SingleCheckExecutor.executeTargets(SingleCheckExecutor.java:36)
        at org.apache.tools.ant.Project.executeTargets(Project.java:1251)
        at org.apache.tools.ant.taskdefs.Ant.execute(Ant.java:437)
        at org.apache.tools.ant.UnknownElement.execute(UnknownElement.java:292)
        at sun.reflect.GeneratedMethodAccessor4.invoke(Unknown Source)
        at sun.reflect.DelegatingMethodAccessorImpl.invoke(DelegatingMethodAccessorImpl.java:43)
        at java.lang.reflect.Method.invoke(Method.java:498)
        at org.apache.tools.ant.dispatch.DispatchUtils.execute(DispatchUtils.java:99)
        at org.apache.tools.ant.Task.perform(Task.java:350)
        at org.apache.tools.ant.Target.execute(Target.java:449)
        at org.apache.tools.ant.Target.performTasks(Target.java:470)
        at org.apache.tools.ant.Project.executeSortedTargets(Project.java:1388)
        at org.apache.tools.ant.Project.executeTarget(Project.java:1361)
        at org.apache.tools.ant.helper.DefaultExecutor.executeTargets(DefaultExecutor.java:41)
        at org.apache.tools.ant.Project.executeTargets(Project.java:1251)
        at org.apache.tools.ant.Main.runBuild(Main.java:834)
        at org.apache.tools.ant.Main.startAnt(Main.java:223)
        at org.apache.tools.ant.launch.Launcher.run(Launcher.java:284)
        at org.apache.tools.ant.launch.Launcher.main(Launcher.java:101)

Total time: 3 minutes 44 seconds


Thanks,
Serkan


Reply | Threaded
Open this post in threaded view
|

Re: compiler is broken

Alex Harui-2

Usually, your default browser cache, but sometimes clearing the Internet Explorer cache (even if you don’t use Internet Explorer) can help.

 

Try downloading the file manually by clicking that link in a browser and run a checksum on the results and see you get something that can be unzipped.

 

HTH,

-Alex

 

From: Serkan Taş <[hidden email]>
Reply-To: "[hidden email]" <[hidden email]>
Date: Thursday, December 13, 2018 at 1:56 PM
To: "[hidden email]" <[hidden email]>
Subject: Re: compiler is broken

 

Hi Alex,

Which browser cache should be cleaned ?

Here is the download command from log :

download_using_mirror:
      [get] Getting: http://www.apache.org/dyn/mirrors/mirrors.cgi/flex/flexunit/4.2.0/binaries/apache-flex-flexunit-4.2.0-4.12.0-bin.zip?asjson=true
      [get] To: D:\dev\royale-emulation-works\github\royale-asjs\frameworks\mirror.json
      [get] .

check_mirror_json:

use_mirror:
   [delete] Deleting: D:\dev\royale-emulation-works\github\royale-asjs\frameworks\mirror.json
     [echo] Using mirror: http://ftp.itu.edu.tr/Mirror/Apache/
      [get] Getting: http://ftp.itu.edu.tr/Mirror/Apache/flex/flexunit/4.2.0/binaries/apache-flex-flexunit-4.2.0-4.12.0-bin.zip
      [get] To: D:\dev\royale-emulation-works\github\royale-asjs\in\apache-flex-flexunit-4.2.0-4.12.0-bin.zip




And full log for reference : https://drive.google.com/open?id=14rWYkD--Dv89nw8H1lJ1Dymg4IQVznKg

Thanks,
Serkan

11.12.2018 22:09 tarihinde Alex Harui yazdı:

Hi Serkan,

 

I don’t think that has anything to do with the compiler.  FlexUnit is for ActionScript unit tests.  I suggest that you clear your browser cache.  Sometimes the download libraries use browser libraries and a bad version of a file will be in a browser cache.

 

HTH,

-Alex

 

From: Serkan Taş [hidden email]
Reply-To: [hidden email] [hidden email]
Date: Tuesday, December 11, 2018 at 11:05 AM
To: [hidden email] [hidden email]
Subject: compiler is broken

 

Hi,

When compiling royale I am getting error below. Any one has idea ?

Here is the end of the log :

get-from-cache-if-needed:
    [unzip] Expanding: D:\dev\royale-emulation-works\github\royale-asjs\in\apache-flex-flexunit-4.2.0-4.12.0-bin.zip into D:\dev\royale-emulation-works\github\royale-asjs\in\flexunit

BUILD FAILED
D:\dev\royale-emulation-works\github\royale-asjs\build.xml:193: The following error occurred while executing this line:
D:\dev\royale-emulation-works\github\royale-asjs\frameworks\build.xml:106: The following error occurred while executing this line:
D:\dev\royale-emulation-works\github\royale-asjs\frameworks\downloads.xml:110: Error while expanding D:\dev\royale-emulation-works\github\royale-asjs\in\apache-flex-flexunit-4.2.0-4.12.0-bin.zip
java.util.zip.ZipException: archive is not a ZIP archive
        at org.apache.tools.zip.ZipFile.positionAtEndOfCentralDirectoryRecord(ZipFile.java:775)
        at org.apache.tools.zip.ZipFile.positionAtCentralDirectory(ZipFile.java:711)
        at org.apache.tools.zip.ZipFile.populateFromCentralDirectory(ZipFile.java:456)
        at org.apache.tools.zip.ZipFile.<init>(ZipFile.java:216)
        at org.apache.tools.ant.taskdefs.Expand.expandFile(Expand.java:190)
        at org.apache.tools.ant.taskdefs.Expand.execute(Expand.java:157)
        at org.apache.tools.ant.UnknownElement.execute(UnknownElement.java:292)
        at sun.reflect.GeneratedMethodAccessor4.invoke(Unknown Source)
        at sun.reflect.DelegatingMethodAccessorImpl.invoke(DelegatingMethodAccessorImpl.java:43)
        at java.lang.reflect.Method.invoke(Method.java:498)
        at org.apache.tools.ant.dispatch.DispatchUtils.execute(DispatchUtils.java:99)
        at org.apache.tools.ant.Task.perform(Task.java:350)
        at org.apache.tools.ant.Target.execute(Target.java:449)
        at org.apache.tools.ant.Target.performTasks(Target.java:470)
        at org.apache.tools.ant.Project.executeSortedTargets(Project.java:1388)
        at org.apache.tools.ant.helper.SingleCheckExecutor.executeTargets(SingleCheckExecutor.java:36)
        at org.apache.tools.ant.Project.executeTargets(Project.java:1251)
        at org.apache.tools.ant.taskdefs.Ant.execute(Ant.java:437)
        at org.apache.tools.ant.UnknownElement.execute(UnknownElement.java:292)
        at sun.reflect.GeneratedMethodAccessor4.invoke(Unknown Source)
        at sun.reflect.DelegatingMethodAccessorImpl.invoke(DelegatingMethodAccessorImpl.java:43)
        at java.lang.reflect.Method.invoke(Method.java:498)
        at org.apache.tools.ant.dispatch.DispatchUtils.execute(DispatchUtils.java:99)
        at org.apache.tools.ant.Task.perform(Task.java:350)
        at org.apache.tools.ant.Target.execute(Target.java:449)
        at org.apache.tools.ant.Target.performTasks(Target.java:470)
        at org.apache.tools.ant.Project.executeSortedTargets(Project.java:1388)
        at org.apache.tools.ant.helper.SingleCheckExecutor.executeTargets(SingleCheckExecutor.java:36)
        at org.apache.tools.ant.Project.executeTargets(Project.java:1251)
        at org.apache.tools.ant.taskdefs.Ant.execute(Ant.java:437)
        at org.apache.tools.ant.UnknownElement.execute(UnknownElement.java:292)
        at sun.reflect.GeneratedMethodAccessor4.invoke(Unknown Source)
        at sun.reflect.DelegatingMethodAccessorImpl.invoke(DelegatingMethodAccessorImpl.java:43)
        at java.lang.reflect.Method.invoke(Method.java:498)
        at org.apache.tools.ant.dispatch.DispatchUtils.execute(DispatchUtils.java:99)
        at org.apache.tools.ant.Task.perform(Task.java:350)
        at org.apache.tools.ant.Target.execute(Target.java:449)
        at org.apache.tools.ant.Target.performTasks(Target.java:470)
        at org.apache.tools.ant.Project.executeSortedTargets(Project.java:1388)
        at org.apache.tools.ant.Project.executeTarget(Project.java:1361)
        at org.apache.tools.ant.helper.DefaultExecutor.executeTargets(DefaultExecutor.java:41)
        at org.apache.tools.ant.Project.executeTargets(Project.java:1251)
        at org.apache.tools.ant.Main.runBuild(Main.java:834)
        at org.apache.tools.ant.Main.startAnt(Main.java:223)
        at org.apache.tools.ant.launch.Launcher.run(Launcher.java:284)
        at org.apache.tools.ant.launch.Launcher.main(Launcher.java:101)

Total time: 3 minutes 44 seconds


Thanks,
Serkan




Reply | Threaded
Open this post in threaded view
|

Re: compiler is broken

Piotr Zarzycki
To me the other solution was as well downloading that file and setup one of the environment variable CACHE - It always being checked during compilation whether file exists there. If not we are trying to download it. 

Find that variable if anything won't work. 

Thanks, Piotr

czw., 13 gru 2018 o 23:17 Alex Harui <[hidden email]> napisał(a):

Usually, your default browser cache, but sometimes clearing the Internet Explorer cache (even if you don’t use Internet Explorer) can help.

 

Try downloading the file manually by clicking that link in a browser and run a checksum on the results and see you get something that can be unzipped.

 

HTH,

-Alex

 

From: Serkan Taş <[hidden email]>
Reply-To: "[hidden email]" <[hidden email]>
Date: Thursday, December 13, 2018 at 1:56 PM
To: "[hidden email]" <[hidden email]>
Subject: Re: compiler is broken

 

Hi Alex,

Which browser cache should be cleaned ?

Here is the download command from log :

download_using_mirror:
      [get] Getting: http://www.apache.org/dyn/mirrors/mirrors.cgi/flex/flexunit/4.2.0/binaries/apache-flex-flexunit-4.2.0-4.12.0-bin.zip?asjson=true
      [get] To: D:\dev\royale-emulation-works\github\royale-asjs\frameworks\mirror.json
      [get] .

check_mirror_json:

use_mirror:
   [delete] Deleting: D:\dev\royale-emulation-works\github\royale-asjs\frameworks\mirror.json
     [echo] Using mirror: http://ftp.itu.edu.tr/Mirror/Apache/
      [get] Getting: http://ftp.itu.edu.tr/Mirror/Apache/flex/flexunit/4.2.0/binaries/apache-flex-flexunit-4.2.0-4.12.0-bin.zip
      [get] To: D:\dev\royale-emulation-works\github\royale-asjs\in\apache-flex-flexunit-4.2.0-4.12.0-bin.zip




And full log for reference : https://drive.google.com/open?id=14rWYkD--Dv89nw8H1lJ1Dymg4IQVznKg

Thanks,
Serkan

11.12.2018 22:09 tarihinde Alex Harui yazdı:

Hi Serkan,

 

I don’t think that has anything to do with the compiler.  FlexUnit is for ActionScript unit tests.  I suggest that you clear your browser cache.  Sometimes the download libraries use browser libraries and a bad version of a file will be in a browser cache.

 

HTH,

-Alex

 

From: Serkan Taş [hidden email]
Reply-To: [hidden email] [hidden email]
Date: Tuesday, December 11, 2018 at 11:05 AM
To: [hidden email] [hidden email]
Subject: compiler is broken

 

Hi,

When compiling royale I am getting error below. Any one has idea ?

Here is the end of the log :

get-from-cache-if-needed:
    [unzip] Expanding: D:\dev\royale-emulation-works\github\royale-asjs\in\apache-flex-flexunit-4.2.0-4.12.0-bin.zip into D:\dev\royale-emulation-works\github\royale-asjs\in\flexunit

BUILD FAILED
D:\dev\royale-emulation-works\github\royale-asjs\build.xml:193: The following error occurred while executing this line:
D:\dev\royale-emulation-works\github\royale-asjs\frameworks\build.xml:106: The following error occurred while executing this line:
D:\dev\royale-emulation-works\github\royale-asjs\frameworks\downloads.xml:110: Error while expanding D:\dev\royale-emulation-works\github\royale-asjs\in\apache-flex-flexunit-4.2.0-4.12.0-bin.zip
java.util.zip.ZipException: archive is not a ZIP archive
        at org.apache.tools.zip.ZipFile.positionAtEndOfCentralDirectoryRecord(ZipFile.java:775)
        at org.apache.tools.zip.ZipFile.positionAtCentralDirectory(ZipFile.java:711)
        at org.apache.tools.zip.ZipFile.populateFromCentralDirectory(ZipFile.java:456)
        at org.apache.tools.zip.ZipFile.<init>(ZipFile.java:216)
        at org.apache.tools.ant.taskdefs.Expand.expandFile(Expand.java:190)
        at org.apache.tools.ant.taskdefs.Expand.execute(Expand.java:157)
        at org.apache.tools.ant.UnknownElement.execute(UnknownElement.java:292)
        at sun.reflect.GeneratedMethodAccessor4.invoke(Unknown Source)
        at sun.reflect.DelegatingMethodAccessorImpl.invoke(DelegatingMethodAccessorImpl.java:43)
        at java.lang.reflect.Method.invoke(Method.java:498)
        at org.apache.tools.ant.dispatch.DispatchUtils.execute(DispatchUtils.java:99)
        at org.apache.tools.ant.Task.perform(Task.java:350)
        at org.apache.tools.ant.Target.execute(Target.java:449)
        at org.apache.tools.ant.Target.performTasks(Target.java:470)
        at org.apache.tools.ant.Project.executeSortedTargets(Project.java:1388)
        at org.apache.tools.ant.helper.SingleCheckExecutor.executeTargets(SingleCheckExecutor.java:36)
        at org.apache.tools.ant.Project.executeTargets(Project.java:1251)
        at org.apache.tools.ant.taskdefs.Ant.execute(Ant.java:437)
        at org.apache.tools.ant.UnknownElement.execute(UnknownElement.java:292)
        at sun.reflect.GeneratedMethodAccessor4.invoke(Unknown Source)
        at sun.reflect.DelegatingMethodAccessorImpl.invoke(DelegatingMethodAccessorImpl.java:43)
        at java.lang.reflect.Method.invoke(Method.java:498)
        at org.apache.tools.ant.dispatch.DispatchUtils.execute(DispatchUtils.java:99)
        at org.apache.tools.ant.Task.perform(Task.java:350)
        at org.apache.tools.ant.Target.execute(Target.java:449)
        at org.apache.tools.ant.Target.performTasks(Target.java:470)
        at org.apache.tools.ant.Project.executeSortedTargets(Project.java:1388)
        at org.apache.tools.ant.helper.SingleCheckExecutor.executeTargets(SingleCheckExecutor.java:36)
        at org.apache.tools.ant.Project.executeTargets(Project.java:1251)
        at org.apache.tools.ant.taskdefs.Ant.execute(Ant.java:437)
        at org.apache.tools.ant.UnknownElement.execute(UnknownElement.java:292)
        at sun.reflect.GeneratedMethodAccessor4.invoke(Unknown Source)
        at sun.reflect.DelegatingMethodAccessorImpl.invoke(DelegatingMethodAccessorImpl.java:43)
        at java.lang.reflect.Method.invoke(Method.java:498)
        at org.apache.tools.ant.dispatch.DispatchUtils.execute(DispatchUtils.java:99)
        at org.apache.tools.ant.Task.perform(Task.java:350)
        at org.apache.tools.ant.Target.execute(Target.java:449)
        at org.apache.tools.ant.Target.performTasks(Target.java:470)
        at org.apache.tools.ant.Project.executeSortedTargets(Project.java:1388)
        at org.apache.tools.ant.Project.executeTarget(Project.java:1361)
        at org.apache.tools.ant.helper.DefaultExecutor.executeTargets(DefaultExecutor.java:41)
        at org.apache.tools.ant.Project.executeTargets(Project.java:1251)
        at org.apache.tools.ant.Main.runBuild(Main.java:834)
        at org.apache.tools.ant.Main.startAnt(Main.java:223)
        at org.apache.tools.ant.launch.Launcher.run(Launcher.java:284)
        at org.apache.tools.ant.launch.Launcher.main(Launcher.java:101)

Total time: 3 minutes 44 seconds


Thanks,
Serkan






--

Piotr Zarzycki 

Patreon: https://www.patreon.com/piotrzarzycki

Reply | Threaded
Open this post in threaded view
|

Re: compiler is broken

Serkan Taş
I guess mirror is broken, is it possible to set not to use mirror ?

14.12.2018 09:39 tarihinde Piotr Zarzycki yazdı:
To me the other solution was as well downloading that file and setup one of the environment variable CACHE - It always being checked during compilation whether file exists there. If not we are trying to download it. 

Find that variable if anything won't work. 

Thanks, Piotr

czw., 13 gru 2018 o 23:17 Alex Harui <[hidden email]> napisał(a):

Usually, your default browser cache, but sometimes clearing the Internet Explorer cache (even if you don’t use Internet Explorer) can help.

 

Try downloading the file manually by clicking that link in a browser and run a checksum on the results and see you get something that can be unzipped.

 

HTH,

-Alex

 

From: Serkan Taş <[hidden email]>
Reply-To: "[hidden email]" <[hidden email]>
Date: Thursday, December 13, 2018 at 1:56 PM
To: "[hidden email]" <[hidden email]>
Subject: Re: compiler is broken

 

Hi Alex,

Which browser cache should be cleaned ?

Here is the download command from log :

download_using_mirror:
      [get] Getting: http://www.apache.org/dyn/mirrors/mirrors.cgi/flex/flexunit/4.2.0/binaries/apache-flex-flexunit-4.2.0-4.12.0-bin.zip?asjson=true
      [get] To: D:\dev\royale-emulation-works\github\royale-asjs\frameworks\mirror.json
      [get] .

check_mirror_json:

use_mirror:
   [delete] Deleting: D:\dev\royale-emulation-works\github\royale-asjs\frameworks\mirror.json
     [echo] Using mirror: http://ftp.itu.edu.tr/Mirror/Apache/
      [get] Getting: http://ftp.itu.edu.tr/Mirror/Apache/flex/flexunit/4.2.0/binaries/apache-flex-flexunit-4.2.0-4.12.0-bin.zip
      [get] To: D:\dev\royale-emulation-works\github\royale-asjs\in\apache-flex-flexunit-4.2.0-4.12.0-bin.zip




And full log for reference : https://drive.google.com/open?id=14rWYkD--Dv89nw8H1lJ1Dymg4IQVznKg

Thanks,
Serkan

11.12.2018 22:09 tarihinde Alex Harui yazdı:

Hi Serkan,

 

I don’t think that has anything to do with the compiler.  FlexUnit is for ActionScript unit tests.  I suggest that you clear your browser cache.  Sometimes the download libraries use browser libraries and a bad version of a file will be in a browser cache.

 

HTH,

-Alex

 

From: Serkan Taş [hidden email]
Reply-To: [hidden email] [hidden email]
Date: Tuesday, December 11, 2018 at 11:05 AM
To: [hidden email] [hidden email]
Subject: compiler is broken

 

Hi,

When compiling royale I am getting error below. Any one has idea ?

Here is the end of the log :

get-from-cache-if-needed:
    [unzip] Expanding: D:\dev\royale-emulation-works\github\royale-asjs\in\apache-flex-flexunit-4.2.0-4.12.0-bin.zip into D:\dev\royale-emulation-works\github\royale-asjs\in\flexunit

BUILD FAILED
D:\dev\royale-emulation-works\github\royale-asjs\build.xml:193: The following error occurred while executing this line:
D:\dev\royale-emulation-works\github\royale-asjs\frameworks\build.xml:106: The following error occurred while executing this line:
D:\dev\royale-emulation-works\github\royale-asjs\frameworks\downloads.xml:110: Error while expanding D:\dev\royale-emulation-works\github\royale-asjs\in\apache-flex-flexunit-4.2.0-4.12.0-bin.zip
java.util.zip.ZipException: archive is not a ZIP archive
        at org.apache.tools.zip.ZipFile.positionAtEndOfCentralDirectoryRecord(ZipFile.java:775)
        at org.apache.tools.zip.ZipFile.positionAtCentralDirectory(ZipFile.java:711)
        at org.apache.tools.zip.ZipFile.populateFromCentralDirectory(ZipFile.java:456)
        at org.apache.tools.zip.ZipFile.<init>(ZipFile.java:216)
        at org.apache.tools.ant.taskdefs.Expand.expandFile(Expand.java:190)
        at org.apache.tools.ant.taskdefs.Expand.execute(Expand.java:157)
        at org.apache.tools.ant.UnknownElement.execute(UnknownElement.java:292)
        at sun.reflect.GeneratedMethodAccessor4.invoke(Unknown Source)
        at sun.reflect.DelegatingMethodAccessorImpl.invoke(DelegatingMethodAccessorImpl.java:43)
        at java.lang.reflect.Method.invoke(Method.java:498)
        at org.apache.tools.ant.dispatch.DispatchUtils.execute(DispatchUtils.java:99)
        at org.apache.tools.ant.Task.perform(Task.java:350)
        at org.apache.tools.ant.Target.execute(Target.java:449)
        at org.apache.tools.ant.Target.performTasks(Target.java:470)
        at org.apache.tools.ant.Project.executeSortedTargets(Project.java:1388)
        at org.apache.tools.ant.helper.SingleCheckExecutor.executeTargets(SingleCheckExecutor.java:36)
        at org.apache.tools.ant.Project.executeTargets(Project.java:1251)
        at org.apache.tools.ant.taskdefs.Ant.execute(Ant.java:437)
        at org.apache.tools.ant.UnknownElement.execute(UnknownElement.java:292)
        at sun.reflect.GeneratedMethodAccessor4.invoke(Unknown Source)
        at sun.reflect.DelegatingMethodAccessorImpl.invoke(DelegatingMethodAccessorImpl.java:43)
        at java.lang.reflect.Method.invoke(Method.java:498)
        at org.apache.tools.ant.dispatch.DispatchUtils.execute(DispatchUtils.java:99)
        at org.apache.tools.ant.Task.perform(Task.java:350)
        at org.apache.tools.ant.Target.execute(Target.java:449)
        at org.apache.tools.ant.Target.performTasks(Target.java:470)
        at org.apache.tools.ant.Project.executeSortedTargets(Project.java:1388)
        at org.apache.tools.ant.helper.SingleCheckExecutor.executeTargets(SingleCheckExecutor.java:36)
        at org.apache.tools.ant.Project.executeTargets(Project.java:1251)
        at org.apache.tools.ant.taskdefs.Ant.execute(Ant.java:437)
        at org.apache.tools.ant.UnknownElement.execute(UnknownElement.java:292)
        at sun.reflect.GeneratedMethodAccessor4.invoke(Unknown Source)
        at sun.reflect.DelegatingMethodAccessorImpl.invoke(DelegatingMethodAccessorImpl.java:43)
        at java.lang.reflect.Method.invoke(Method.java:498)
        at org.apache.tools.ant.dispatch.DispatchUtils.execute(DispatchUtils.java:99)
        at org.apache.tools.ant.Task.perform(Task.java:350)
        at org.apache.tools.ant.Target.execute(Target.java:449)
        at org.apache.tools.ant.Target.performTasks(Target.java:470)
        at org.apache.tools.ant.Project.executeSortedTargets(Project.java:1388)
        at org.apache.tools.ant.Project.executeTarget(Project.java:1361)
        at org.apache.tools.ant.helper.DefaultExecutor.executeTargets(DefaultExecutor.java:41)
        at org.apache.tools.ant.Project.executeTargets(Project.java:1251)
        at org.apache.tools.ant.Main.runBuild(Main.java:834)
        at org.apache.tools.ant.Main.startAnt(Main.java:223)
        at org.apache.tools.ant.launch.Launcher.run(Launcher.java:284)
        at org.apache.tools.ant.launch.Launcher.main(Launcher.java:101)

Total time: 3 minutes 44 seconds


Thanks,
Serkan






--

Piotr Zarzycki 

Patreon: https://www.patreon.com/piotrzarzycki


Reply | Threaded
Open this post in threaded view
|

Re: compiler is broken

Alex Harui-2

Hmm.  Maybe the cgi isn’t working.

 

Try: http://www.apache.org/dyn/closer.lua/flex/flexunit/4.2.0/binaries/apache-flex-flexunit-4.2.0-4.12.0-bin.zip

 

HTH,

-Alex

 

From: Serkan Taş <[hidden email]>
Reply-To: "[hidden email]" <[hidden email]>
Date: Saturday, December 15, 2018 at 3:13 AM
To: "[hidden email]" <[hidden email]>
Subject: Re: compiler is broken

 

I guess mirror is broken, is it possible to set not to use mirror ?

14.12.2018 09:39 tarihinde Piotr Zarzycki yazdı:

To me the other solution was as well downloading that file and setup one of the environment variable CACHE - It always being checked during compilation whether file exists there. If not we are trying to download it. 

 

Find that variable if anything won't work. 

 

Thanks, Piotr

 

czw., 13 gru 2018 o 23:17 Alex Harui <[hidden email]> napisał(a):

Usually, your default browser cache, but sometimes clearing the Internet Explorer cache (even if you don’t use Internet Explorer) can help.

 

Try downloading the file manually by clicking that link in a browser and run a checksum on the results and see you get something that can be unzipped.

 

HTH,

-Alex

 

From: Serkan Taş <[hidden email]>
Reply-To: "[hidden email]" <[hidden email]>
Date: Thursday, December 13, 2018 at 1:56 PM
To: "[hidden email]" <[hidden email]>
Subject: Re: compiler is broken

 

Hi Alex,

Which browser cache should be cleaned ?

Here is the download command from log :

download_using_mirror:
      [get] Getting: http://www.apache.org/dyn/mirrors/mirrors.cgi/flex/flexunit/4.2.0/binaries/apache-flex-flexunit-4.2.0-4.12.0-bin.zip?asjson=true
      [get] To: D:\dev\royale-emulation-works\github\royale-asjs\frameworks\mirror.json
      [get] .

check_mirror_json:

use_mirror:
   [delete] Deleting: D:\dev\royale-emulation-works\github\royale-asjs\frameworks\mirror.json
     [echo] Using mirror: http://ftp.itu.edu.tr/Mirror/Apache/
      [get] Getting: http://ftp.itu.edu.tr/Mirror/Apache/flex/flexunit/4.2.0/binaries/apache-flex-flexunit-4.2.0-4.12.0-bin.zip
      [get] To: D:\dev\royale-emulation-works\github\royale-asjs\in\apache-flex-flexunit-4.2.0-4.12.0-bin.zip




And full log for reference : https://drive.google.com/open?id=14rWYkD--Dv89nw8H1lJ1Dymg4IQVznKg

Thanks,
Serkan

11.12.2018 22:09 tarihinde Alex Harui yazdı:

Hi Serkan,

 

I don’t think that has anything to do with the compiler.  FlexUnit is for ActionScript unit tests.  I suggest that you clear your browser cache.  Sometimes the download libraries use browser libraries and a bad version of a file will be in a browser cache.

 

HTH,

-Alex

 

From: Serkan Taş [hidden email]
Reply-To: [hidden email] [hidden email]
Date: Tuesday, December 11, 2018 at 11:05 AM
To: [hidden email] [hidden email]
Subject: compiler is broken

 

Hi,

When compiling royale I am getting error below. Any one has idea ?

Here is the end of the log :

get-from-cache-if-needed:
    [unzip] Expanding: D:\dev\royale-emulation-works\github\royale-asjs\in\apache-flex-flexunit-4.2.0-4.12.0-bin.zip into D:\dev\royale-emulation-works\github\royale-asjs\in\flexunit

BUILD FAILED
D:\dev\royale-emulation-works\github\royale-asjs\build.xml:193: The following error occurred while executing this line:
D:\dev\royale-emulation-works\github\royale-asjs\frameworks\build.xml:106: The following error occurred while executing this line:
D:\dev\royale-emulation-works\github\royale-asjs\frameworks\downloads.xml:110: Error while expanding D:\dev\royale-emulation-works\github\royale-asjs\in\apache-flex-flexunit-4.2.0-4.12.0-bin.zip
java.util.zip.ZipException: archive is not a ZIP archive
        at org.apache.tools.zip.ZipFile.positionAtEndOfCentralDirectoryRecord(ZipFile.java:775)
        at org.apache.tools.zip.ZipFile.positionAtCentralDirectory(ZipFile.java:711)
        at org.apache.tools.zip.ZipFile.populateFromCentralDirectory(ZipFile.java:456)
        at org.apache.tools.zip.ZipFile.<init>(ZipFile.java:216)
        at org.apache.tools.ant.taskdefs.Expand.expandFile(Expand.java:190)
        at org.apache.tools.ant.taskdefs.Expand.execute(Expand.java:157)
        at org.apache.tools.ant.UnknownElement.execute(UnknownElement.java:292)
        at sun.reflect.GeneratedMethodAccessor4.invoke(Unknown Source)
        at sun.reflect.DelegatingMethodAccessorImpl.invoke(DelegatingMethodAccessorImpl.java:43)
        at java.lang.reflect.Method.invoke(Method.java:498)
        at org.apache.tools.ant.dispatch.DispatchUtils.execute(DispatchUtils.java:99)
        at org.apache.tools.ant.Task.perform(Task.java:350)
        at org.apache.tools.ant.Target.execute(Target.java:449)
        at org.apache.tools.ant.Target.performTasks(Target.java:470)
        at org.apache.tools.ant.Project.executeSortedTargets(Project.java:1388)
        at org.apache.tools.ant.helper.SingleCheckExecutor.executeTargets(SingleCheckExecutor.java:36)
        at org.apache.tools.ant.Project.executeTargets(Project.java:1251)
        at org.apache.tools.ant.taskdefs.Ant.execute(Ant.java:437)
        at org.apache.tools.ant.UnknownElement.execute(UnknownElement.java:292)
        at sun.reflect.GeneratedMethodAccessor4.invoke(Unknown Source)
        at sun.reflect.DelegatingMethodAccessorImpl.invoke(DelegatingMethodAccessorImpl.java:43)
        at java.lang.reflect.Method.invoke(Method.java:498)
        at org.apache.tools.ant.dispatch.DispatchUtils.execute(DispatchUtils.java:99)
        at org.apache.tools.ant.Task.perform(Task.java:350)
        at org.apache.tools.ant.Target.execute(Target.java:449)
        at org.apache.tools.ant.Target.performTasks(Target.java:470)
        at org.apache.tools.ant.Project.executeSortedTargets(Project.java:1388)
        at org.apache.tools.ant.helper.SingleCheckExecutor.executeTargets(SingleCheckExecutor.java:36)
        at org.apache.tools.ant.Project.executeTargets(Project.java:1251)
        at org.apache.tools.ant.taskdefs.Ant.execute(Ant.java:437)
        at org.apache.tools.ant.UnknownElement.execute(UnknownElement.java:292)
        at sun.reflect.GeneratedMethodAccessor4.invoke(Unknown Source)
        at sun.reflect.DelegatingMethodAccessorImpl.invoke(DelegatingMethodAccessorImpl.java:43)
        at java.lang.reflect.Method.invoke(Method.java:498)
        at org.apache.tools.ant.dispatch.DispatchUtils.execute(DispatchUtils.java:99)
        at org.apache.tools.ant.Task.perform(Task.java:350)
        at org.apache.tools.ant.Target.execute(Target.java:449)
        at org.apache.tools.ant.Target.performTasks(Target.java:470)
        at org.apache.tools.ant.Project.executeSortedTargets(Project.java:1388)
        at org.apache.tools.ant.Project.executeTarget(Project.java:1361)
        at org.apache.tools.ant.helper.DefaultExecutor.executeTargets(DefaultExecutor.java:41)
        at org.apache.tools.ant.Project.executeTargets(Project.java:1251)
        at org.apache.tools.ant.Main.runBuild(Main.java:834)
        at org.apache.tools.ant.Main.startAnt(Main.java:223)
        at org.apache.tools.ant.launch.Launcher.run(Launcher.java:284)
        at org.apache.tools.ant.launch.Launcher.main(Launcher.java:101)

Total time: 3 minutes 44 seconds


Thanks,
Serkan

 


 

--

Piotr Zarzycki 

Patreon: https://www.patreon.com/piotrzarzycki



Reply | Threaded
Open this post in threaded view
|

Re: compiler is broken

Serkan Taş
The link is not working Alex, just 16K is downloaded may be it is related with my environment.

Thanks,
Serkan

16.12.2018 10:04 tarihinde Alex Harui yazdı:

Hmm.  Maybe the cgi isn’t working.

 

Try: http://www.apache.org/dyn/closer.lua/flex/flexunit/4.2.0/binaries/apache-flex-flexunit-4.2.0-4.12.0-bin.zip

 

HTH,

-Alex

 

From: Serkan Taş [hidden email]
Reply-To: [hidden email] [hidden email]
Date: Saturday, December 15, 2018 at 3:13 AM
To: [hidden email] [hidden email]
Subject: Re: compiler is broken

 

I guess mirror is broken, is it possible to set not to use mirror ?

14.12.2018 09:39 tarihinde Piotr Zarzycki yazdı:

To me the other solution was as well downloading that file and setup one of the environment variable CACHE - It always being checked during compilation whether file exists there. If not we are trying to download it. 

 

Find that variable if anything won't work. 

 

Thanks, Piotr

 

czw., 13 gru 2018 o 23:17 Alex Harui <[hidden email]> napisał(a):

Usually, your default browser cache, but sometimes clearing the Internet Explorer cache (even if you don’t use Internet Explorer) can help.

 

Try downloading the file manually by clicking that link in a browser and run a checksum on the results and see you get something that can be unzipped.

 

HTH,

-Alex

 

From: Serkan Taş <[hidden email]>
Reply-To: "[hidden email]" <[hidden email]>
Date: Thursday, December 13, 2018 at 1:56 PM
To: "[hidden email]" <[hidden email]>
Subject: Re: compiler is broken

 

Hi Alex,

Which browser cache should be cleaned ?

Here is the download command from log :

download_using_mirror:
      [get] Getting: http://www.apache.org/dyn/mirrors/mirrors.cgi/flex/flexunit/4.2.0/binaries/apache-flex-flexunit-4.2.0-4.12.0-bin.zip?asjson=true
      [get] To: D:\dev\royale-emulation-works\github\royale-asjs\frameworks\mirror.json
      [get] .

check_mirror_json:

use_mirror:
   [delete] Deleting: D:\dev\royale-emulation-works\github\royale-asjs\frameworks\mirror.json
     [echo] Using mirror: http://ftp.itu.edu.tr/Mirror/Apache/
      [get] Getting: http://ftp.itu.edu.tr/Mirror/Apache/flex/flexunit/4.2.0/binaries/apache-flex-flexunit-4.2.0-4.12.0-bin.zip
      [get] To: D:\dev\royale-emulation-works\github\royale-asjs\in\apache-flex-flexunit-4.2.0-4.12.0-bin.zip




And full log for reference : https://drive.google.com/open?id=14rWYkD--Dv89nw8H1lJ1Dymg4IQVznKg

Thanks,
Serkan

11.12.2018 22:09 tarihinde Alex Harui yazdı:

Hi Serkan,

 

I don’t think that has anything to do with the compiler.  FlexUnit is for ActionScript unit tests.  I suggest that you clear your browser cache.  Sometimes the download libraries use browser libraries and a bad version of a file will be in a browser cache.

 

HTH,

-Alex

 

From: Serkan Taş [hidden email]
Reply-To: [hidden email] [hidden email]
Date: Tuesday, December 11, 2018 at 11:05 AM
To: [hidden email] [hidden email]
Subject: compiler is broken

 

Hi,

When compiling royale I am getting error below. Any one has idea ?

Here is the end of the log :

get-from-cache-if-needed:
    [unzip] Expanding: D:\dev\royale-emulation-works\github\royale-asjs\in\apache-flex-flexunit-4.2.0-4.12.0-bin.zip into D:\dev\royale-emulation-works\github\royale-asjs\in\flexunit

BUILD FAILED
D:\dev\royale-emulation-works\github\royale-asjs\build.xml:193: The following error occurred while executing this line:
D:\dev\royale-emulation-works\github\royale-asjs\frameworks\build.xml:106: The following error occurred while executing this line:
D:\dev\royale-emulation-works\github\royale-asjs\frameworks\downloads.xml:110: Error while expanding D:\dev\royale-emulation-works\github\royale-asjs\in\apache-flex-flexunit-4.2.0-4.12.0-bin.zip
java.util.zip.ZipException: archive is not a ZIP archive
        at org.apache.tools.zip.ZipFile.positionAtEndOfCentralDirectoryRecord(ZipFile.java:775)
        at org.apache.tools.zip.ZipFile.positionAtCentralDirectory(ZipFile.java:711)
        at org.apache.tools.zip.ZipFile.populateFromCentralDirectory(ZipFile.java:456)
        at org.apache.tools.zip.ZipFile.<init>(ZipFile.java:216)
        at org.apache.tools.ant.taskdefs.Expand.expandFile(Expand.java:190)
        at org.apache.tools.ant.taskdefs.Expand.execute(Expand.java:157)
        at org.apache.tools.ant.UnknownElement.execute(UnknownElement.java:292)
        at sun.reflect.GeneratedMethodAccessor4.invoke(Unknown Source)
        at sun.reflect.DelegatingMethodAccessorImpl.invoke(DelegatingMethodAccessorImpl.java:43)
        at java.lang.reflect.Method.invoke(Method.java:498)
        at org.apache.tools.ant.dispatch.DispatchUtils.execute(DispatchUtils.java:99)
        at org.apache.tools.ant.Task.perform(Task.java:350)
        at org.apache.tools.ant.Target.execute(Target.java:449)
        at org.apache.tools.ant.Target.performTasks(Target.java:470)
        at org.apache.tools.ant.Project.executeSortedTargets(Project.java:1388)
        at org.apache.tools.ant.helper.SingleCheckExecutor.executeTargets(SingleCheckExecutor.java:36)
        at org.apache.tools.ant.Project.executeTargets(Project.java:1251)
        at org.apache.tools.ant.taskdefs.Ant.execute(Ant.java:437)
        at org.apache.tools.ant.UnknownElement.execute(UnknownElement.java:292)
        at sun.reflect.GeneratedMethodAccessor4.invoke(Unknown Source)
        at sun.reflect.DelegatingMethodAccessorImpl.invoke(DelegatingMethodAccessorImpl.java:43)
        at java.lang.reflect.Method.invoke(Method.java:498)
        at org.apache.tools.ant.dispatch.DispatchUtils.execute(DispatchUtils.java:99)
        at org.apache.tools.ant.Task.perform(Task.java:350)
        at org.apache.tools.ant.Target.execute(Target.java:449)
        at org.apache.tools.ant.Target.performTasks(Target.java:470)
        at org.apache.tools.ant.Project.executeSortedTargets(Project.java:1388)
        at org.apache.tools.ant.helper.SingleCheckExecutor.executeTargets(SingleCheckExecutor.java:36)
        at org.apache.tools.ant.Project.executeTargets(Project.java:1251)
        at org.apache.tools.ant.taskdefs.Ant.execute(Ant.java:437)
        at org.apache.tools.ant.UnknownElement.execute(UnknownElement.java:292)
        at sun.reflect.GeneratedMethodAccessor4.invoke(Unknown Source)
        at sun.reflect.DelegatingMethodAccessorImpl.invoke(DelegatingMethodAccessorImpl.java:43)
        at java.lang.reflect.Method.invoke(Method.java:498)
        at org.apache.tools.ant.dispatch.DispatchUtils.execute(DispatchUtils.java:99)
        at org.apache.tools.ant.Task.perform(Task.java:350)
        at org.apache.tools.ant.Target.execute(Target.java:449)
        at org.apache.tools.ant.Target.performTasks(Target.java:470)
        at org.apache.tools.ant.Project.executeSortedTargets(Project.java:1388)
        at org.apache.tools.ant.Project.executeTarget(Project.java:1361)
        at org.apache.tools.ant.helper.DefaultExecutor.executeTargets(DefaultExecutor.java:41)
        at org.apache.tools.ant.Project.executeTargets(Project.java:1251)
        at org.apache.tools.ant.Main.runBuild(Main.java:834)
        at org.apache.tools.ant.Main.startAnt(Main.java:223)
        at org.apache.tools.ant.launch.Launcher.run(Launcher.java:284)
        at org.apache.tools.ant.launch.Launcher.main(Launcher.java:101)

Total time: 3 minutes 44 seconds


Thanks,
Serkan

 


 

--

Piotr Zarzycki 

Patreon: https://www.patreon.com/piotrzarzycki




Reply | Threaded
Open this post in threaded view
|

Re: compiler is broken

Serkan Taş
This time it is ok, I tired https://www-eu.apache.org/dist/flex/flexunit/4.2.0/binaries/apache-flex-flexunit-4.2.0-4.12.0-bin.zip

Thanks,
Serkan

16.12.2018 22:42 tarihinde Serkan Taş yazdı:
The link is not working Alex, just 16K is downloaded may be it is related with my environment.

Thanks,
Serkan

16.12.2018 10:04 tarihinde Alex Harui yazdı:

Hmm.  Maybe the cgi isn’t working.

 

Try: http://www.apache.org/dyn/closer.lua/flex/flexunit/4.2.0/binaries/apache-flex-flexunit-4.2.0-4.12.0-bin.zip

 

HTH,

-Alex

 

From: Serkan Taş [hidden email]
Reply-To: [hidden email] [hidden email]
Date: Saturday, December 15, 2018 at 3:13 AM
To: [hidden email] [hidden email]
Subject: Re: compiler is broken

 

I guess mirror is broken, is it possible to set not to use mirror ?

14.12.2018 09:39 tarihinde Piotr Zarzycki yazdı:

To me the other solution was as well downloading that file and setup one of the environment variable CACHE - It always being checked during compilation whether file exists there. If not we are trying to download it. 

 

Find that variable if anything won't work. 

 

Thanks, Piotr

 

czw., 13 gru 2018 o 23:17 Alex Harui <[hidden email]> napisał(a):

Usually, your default browser cache, but sometimes clearing the Internet Explorer cache (even if you don’t use Internet Explorer) can help.

 

Try downloading the file manually by clicking that link in a browser and run a checksum on the results and see you get something that can be unzipped.

 

HTH,

-Alex

 

From: Serkan Taş <[hidden email]>
Reply-To: "[hidden email]" <[hidden email]>
Date: Thursday, December 13, 2018 at 1:56 PM
To: "[hidden email]" <[hidden email]>
Subject: Re: compiler is broken

 

Hi Alex,

Which browser cache should be cleaned ?

Here is the download command from log :

download_using_mirror:
      [get] Getting: http://www.apache.org/dyn/mirrors/mirrors.cgi/flex/flexunit/4.2.0/binaries/apache-flex-flexunit-4.2.0-4.12.0-bin.zip?asjson=true
      [get] To: D:\dev\royale-emulation-works\github\royale-asjs\frameworks\mirror.json
      [get] .

check_mirror_json:

use_mirror:
   [delete] Deleting: D:\dev\royale-emulation-works\github\royale-asjs\frameworks\mirror.json
     [echo] Using mirror: http://ftp.itu.edu.tr/Mirror/Apache/
      [get] Getting: http://ftp.itu.edu.tr/Mirror/Apache/flex/flexunit/4.2.0/binaries/apache-flex-flexunit-4.2.0-4.12.0-bin.zip
      [get] To: D:\dev\royale-emulation-works\github\royale-asjs\in\apache-flex-flexunit-4.2.0-4.12.0-bin.zip




And full log for reference : https://drive.google.com/open?id=14rWYkD--Dv89nw8H1lJ1Dymg4IQVznKg

Thanks,
Serkan

11.12.2018 22:09 tarihinde Alex Harui yazdı:

Hi Serkan,

 

I don’t think that has anything to do with the compiler.  FlexUnit is for ActionScript unit tests.  I suggest that you clear your browser cache.  Sometimes the download libraries use browser libraries and a bad version of a file will be in a browser cache.

 

HTH,

-Alex

 

From: Serkan Taş [hidden email]
Reply-To: [hidden email] [hidden email]
Date: Tuesday, December 11, 2018 at 11:05 AM
To: [hidden email] [hidden email]
Subject: compiler is broken

 

Hi,

When compiling royale I am getting error below. Any one has idea ?

Here is the end of the log :

get-from-cache-if-needed:
    [unzip] Expanding: D:\dev\royale-emulation-works\github\royale-asjs\in\apache-flex-flexunit-4.2.0-4.12.0-bin.zip into D:\dev\royale-emulation-works\github\royale-asjs\in\flexunit

BUILD FAILED
D:\dev\royale-emulation-works\github\royale-asjs\build.xml:193: The following error occurred while executing this line:
D:\dev\royale-emulation-works\github\royale-asjs\frameworks\build.xml:106: The following error occurred while executing this line:
D:\dev\royale-emulation-works\github\royale-asjs\frameworks\downloads.xml:110: Error while expanding D:\dev\royale-emulation-works\github\royale-asjs\in\apache-flex-flexunit-4.2.0-4.12.0-bin.zip
java.util.zip.ZipException: archive is not a ZIP archive
        at org.apache.tools.zip.ZipFile.positionAtEndOfCentralDirectoryRecord(ZipFile.java:775)
        at org.apache.tools.zip.ZipFile.positionAtCentralDirectory(ZipFile.java:711)
        at org.apache.tools.zip.ZipFile.populateFromCentralDirectory(ZipFile.java:456)
        at org.apache.tools.zip.ZipFile.<init>(ZipFile.java:216)
        at org.apache.tools.ant.taskdefs.Expand.expandFile(Expand.java:190)
        at org.apache.tools.ant.taskdefs.Expand.execute(Expand.java:157)
        at org.apache.tools.ant.UnknownElement.execute(UnknownElement.java:292)
        at sun.reflect.GeneratedMethodAccessor4.invoke(Unknown Source)
        at sun.reflect.DelegatingMethodAccessorImpl.invoke(DelegatingMethodAccessorImpl.java:43)
        at java.lang.reflect.Method.invoke(Method.java:498)
        at org.apache.tools.ant.dispatch.DispatchUtils.execute(DispatchUtils.java:99)
        at org.apache.tools.ant.Task.perform(Task.java:350)
        at org.apache.tools.ant.Target.execute(Target.java:449)
        at org.apache.tools.ant.Target.performTasks(Target.java:470)
        at org.apache.tools.ant.Project.executeSortedTargets(Project.java:1388)
        at org.apache.tools.ant.helper.SingleCheckExecutor.executeTargets(SingleCheckExecutor.java:36)
        at org.apache.tools.ant.Project.executeTargets(Project.java:1251)
        at org.apache.tools.ant.taskdefs.Ant.execute(Ant.java:437)
        at org.apache.tools.ant.UnknownElement.execute(UnknownElement.java:292)
        at sun.reflect.GeneratedMethodAccessor4.invoke(Unknown Source)
        at sun.reflect.DelegatingMethodAccessorImpl.invoke(DelegatingMethodAccessorImpl.java:43)
        at java.lang.reflect.Method.invoke(Method.java:498)
        at org.apache.tools.ant.dispatch.DispatchUtils.execute(DispatchUtils.java:99)
        at org.apache.tools.ant.Task.perform(Task.java:350)
        at org.apache.tools.ant.Target.execute(Target.java:449)
        at org.apache.tools.ant.Target.performTasks(Target.java:470)
        at org.apache.tools.ant.Project.executeSortedTargets(Project.java:1388)
        at org.apache.tools.ant.helper.SingleCheckExecutor.executeTargets(SingleCheckExecutor.java:36)
        at org.apache.tools.ant.Project.executeTargets(Project.java:1251)
        at org.apache.tools.ant.taskdefs.Ant.execute(Ant.java:437)
        at org.apache.tools.ant.UnknownElement.execute(UnknownElement.java:292)
        at sun.reflect.GeneratedMethodAccessor4.invoke(Unknown Source)
        at sun.reflect.DelegatingMethodAccessorImpl.invoke(DelegatingMethodAccessorImpl.java:43)
        at java.lang.reflect.Method.invoke(Method.java:498)
        at org.apache.tools.ant.dispatch.DispatchUtils.execute(DispatchUtils.java:99)
        at org.apache.tools.ant.Task.perform(Task.java:350)
        at org.apache.tools.ant.Target.execute(Target.java:449)
        at org.apache.tools.ant.Target.performTasks(Target.java:470)
        at org.apache.tools.ant.Project.executeSortedTargets(Project.java:1388)
        at org.apache.tools.ant.Project.executeTarget(Project.java:1361)
        at org.apache.tools.ant.helper.DefaultExecutor.executeTargets(DefaultExecutor.java:41)
        at org.apache.tools.ant.Project.executeTargets(Project.java:1251)
        at org.apache.tools.ant.Main.runBuild(Main.java:834)
        at org.apache.tools.ant.Main.startAnt(Main.java:223)
        at org.apache.tools.ant.launch.Launcher.run(Launcher.java:284)
        at org.apache.tools.ant.launch.Launcher.main(Launcher.java:101)

Total time: 3 minutes 44 seconds


Thanks,
Serkan

 


 

--

Piotr Zarzycki 

Patreon: https://www.patreon.com/piotrzarzycki





Reply | Threaded
Open this post in threaded view
|

Re: compiler is broken

Serkan Taş
Hi,

When I downloaded the zip file from the link
https://www-eu.apache.org/dist/flex/flexunit/4.2.0/binaries/apache-flex-flexunit-4.2.0-4.12.0-bin.zip
and put it into the folder royale-asjs/in, I expected the compiler should not delete, bud done so.

Two problems here:

1. The mirror and the file in apache is somehow broken :(e.g)
http://www.apache.org/dyn/closer.lua/flex/flexunit/4.2.0/binaries/apache-flex-flexunit-4.2.0-4.12.0-bin.zip
2. File are deleted and downloaded each time during the build.

May give some idea.

It is not blocking me for now as I am using nightly builds unit I find a fix.

Thanks,
Serkan

16.12.2018 22:53 tarihinde Serkan Taş yazdı:
This time it is ok, I tired https://www-eu.apache.org/dist/flex/flexunit/4.2.0/binaries/apache-flex-flexunit-4.2.0-4.12.0-bin.zip

Thanks,
Serkan

16.12.2018 22:42 tarihinde Serkan Taş yazdı:
The link is not working Alex, just 16K is downloaded may be it is related with my environment.

Thanks,
Serkan

16.12.2018 10:04 tarihinde Alex Harui yazdı:

Hmm.  Maybe the cgi isn’t working.

 

Try: http://www.apache.org/dyn/closer.lua/flex/flexunit/4.2.0/binaries/apache-flex-flexunit-4.2.0-4.12.0-bin.zip

 

HTH,

-Alex

 

From: Serkan Taş [hidden email]
Reply-To: [hidden email] [hidden email]
Date: Saturday, December 15, 2018 at 3:13 AM
To: [hidden email] [hidden email]
Subject: Re: compiler is broken

 

I guess mirror is broken, is it possible to set not to use mirror ?

14.12.2018 09:39 tarihinde Piotr Zarzycki yazdı:

To me the other solution was as well downloading that file and setup one of the environment variable CACHE - It always being checked during compilation whether file exists there. If not we are trying to download it. 

 

Find that variable if anything won't work. 

 

Thanks, Piotr

 

czw., 13 gru 2018 o 23:17 Alex Harui <[hidden email]> napisał(a):

Usually, your default browser cache, but sometimes clearing the Internet Explorer cache (even if you don’t use Internet Explorer) can help.

 

Try downloading the file manually by clicking that link in a browser and run a checksum on the results and see you get something that can be unzipped.

 

HTH,

-Alex

 

From: Serkan Taş <[hidden email]>
Reply-To: "[hidden email]" <[hidden email]>
Date: Thursday, December 13, 2018 at 1:56 PM
To: "[hidden email]" <[hidden email]>
Subject: Re: compiler is broken

 

Hi Alex,

Which browser cache should be cleaned ?

Here is the download command from log :

download_using_mirror:
      [get] Getting: http://www.apache.org/dyn/mirrors/mirrors.cgi/flex/flexunit/4.2.0/binaries/apache-flex-flexunit-4.2.0-4.12.0-bin.zip?asjson=true
      [get] To: D:\dev\royale-emulation-works\github\royale-asjs\frameworks\mirror.json
      [get] .

check_mirror_json:

use_mirror:
   [delete] Deleting: D:\dev\royale-emulation-works\github\royale-asjs\frameworks\mirror.json
     [echo] Using mirror: http://ftp.itu.edu.tr/Mirror/Apache/
      [get] Getting: http://ftp.itu.edu.tr/Mirror/Apache/flex/flexunit/4.2.0/binaries/apache-flex-flexunit-4.2.0-4.12.0-bin.zip
      [get] To: D:\dev\royale-emulation-works\github\royale-asjs\in\apache-flex-flexunit-4.2.0-4.12.0-bin.zip




And full log for reference : https://drive.google.com/open?id=14rWYkD--Dv89nw8H1lJ1Dymg4IQVznKg

Thanks,
Serkan

11.12.2018 22:09 tarihinde Alex Harui yazdı:

Hi Serkan,

 

I don’t think that has anything to do with the compiler.  FlexUnit is for ActionScript unit tests.  I suggest that you clear your browser cache.  Sometimes the download libraries use browser libraries and a bad version of a file will be in a browser cache.

 

HTH,

-Alex

 

From: Serkan Taş [hidden email]
Reply-To: [hidden email] [hidden email]
Date: Tuesday, December 11, 2018 at 11:05 AM
To: [hidden email] [hidden email]
Subject: compiler is broken

 

Hi,

When compiling royale I am getting error below. Any one has idea ?

Here is the end of the log :

get-from-cache-if-needed:
    [unzip] Expanding: D:\dev\royale-emulation-works\github\royale-asjs\in\apache-flex-flexunit-4.2.0-4.12.0-bin.zip into D:\dev\royale-emulation-works\github\royale-asjs\in\flexunit

BUILD FAILED
D:\dev\royale-emulation-works\github\royale-asjs\build.xml:193: The following error occurred while executing this line:
D:\dev\royale-emulation-works\github\royale-asjs\frameworks\build.xml:106: The following error occurred while executing this line:
D:\dev\royale-emulation-works\github\royale-asjs\frameworks\downloads.xml:110: Error while expanding D:\dev\royale-emulation-works\github\royale-asjs\in\apache-flex-flexunit-4.2.0-4.12.0-bin.zip
java.util.zip.ZipException: archive is not a ZIP archive
        at org.apache.tools.zip.ZipFile.positionAtEndOfCentralDirectoryRecord(ZipFile.java:775)
        at org.apache.tools.zip.ZipFile.positionAtCentralDirectory(ZipFile.java:711)
        at org.apache.tools.zip.ZipFile.populateFromCentralDirectory(ZipFile.java:456)
        at org.apache.tools.zip.ZipFile.<init>(ZipFile.java:216)
        at org.apache.tools.ant.taskdefs.Expand.expandFile(Expand.java:190)
        at org.apache.tools.ant.taskdefs.Expand.execute(Expand.java:157)
        at org.apache.tools.ant.UnknownElement.execute(UnknownElement.java:292)
        at sun.reflect.GeneratedMethodAccessor4.invoke(Unknown Source)
        at sun.reflect.DelegatingMethodAccessorImpl.invoke(DelegatingMethodAccessorImpl.java:43)
        at java.lang.reflect.Method.invoke(Method.java:498)
        at org.apache.tools.ant.dispatch.DispatchUtils.execute(DispatchUtils.java:99)
        at org.apache.tools.ant.Task.perform(Task.java:350)
        at org.apache.tools.ant.Target.execute(Target.java:449)
        at org.apache.tools.ant.Target.performTasks(Target.java:470)
        at org.apache.tools.ant.Project.executeSortedTargets(Project.java:1388)
        at org.apache.tools.ant.helper.SingleCheckExecutor.executeTargets(SingleCheckExecutor.java:36)
        at org.apache.tools.ant.Project.executeTargets(Project.java:1251)
        at org.apache.tools.ant.taskdefs.Ant.execute(Ant.java:437)
        at org.apache.tools.ant.UnknownElement.execute(UnknownElement.java:292)
        at sun.reflect.GeneratedMethodAccessor4.invoke(Unknown Source)
        at sun.reflect.DelegatingMethodAccessorImpl.invoke(DelegatingMethodAccessorImpl.java:43)
        at java.lang.reflect.Method.invoke(Method.java:498)
        at org.apache.tools.ant.dispatch.DispatchUtils.execute(DispatchUtils.java:99)
        at org.apache.tools.ant.Task.perform(Task.java:350)
        at org.apache.tools.ant.Target.execute(Target.java:449)
        at org.apache.tools.ant.Target.performTasks(Target.java:470)
        at org.apache.tools.ant.Project.executeSortedTargets(Project.java:1388)
        at org.apache.tools.ant.helper.SingleCheckExecutor.executeTargets(SingleCheckExecutor.java:36)
        at org.apache.tools.ant.Project.executeTargets(Project.java:1251)
        at org.apache.tools.ant.taskdefs.Ant.execute(Ant.java:437)
        at org.apache.tools.ant.UnknownElement.execute(UnknownElement.java:292)
        at sun.reflect.GeneratedMethodAccessor4.invoke(Unknown Source)
        at sun.reflect.DelegatingMethodAccessorImpl.invoke(DelegatingMethodAccessorImpl.java:43)
        at java.lang.reflect.Method.invoke(Method.java:498)
        at org.apache.tools.ant.dispatch.DispatchUtils.execute(DispatchUtils.java:99)
        at org.apache.tools.ant.Task.perform(Task.java:350)
        at org.apache.tools.ant.Target.execute(Target.java:449)
        at org.apache.tools.ant.Target.performTasks(Target.java:470)
        at org.apache.tools.ant.Project.executeSortedTargets(Project.java:1388)
        at org.apache.tools.ant.Project.executeTarget(Project.java:1361)
        at org.apache.tools.ant.helper.DefaultExecutor.executeTargets(DefaultExecutor.java:41)
        at org.apache.tools.ant.Project.executeTargets(Project.java:1251)
        at org.apache.tools.ant.Main.runBuild(Main.java:834)
        at org.apache.tools.ant.Main.startAnt(Main.java:223)
        at org.apache.tools.ant.launch.Launcher.run(Launcher.java:284)
        at org.apache.tools.ant.launch.Launcher.main(Launcher.java:101)

Total time: 3 minutes 44 seconds


Thanks,
Serkan

 


 

--

Piotr Zarzycki 

Patreon: https://www.patreon.com/piotrzarzycki






Reply | Threaded
Open this post in threaded view
|

Re: compiler is broken

Alex Harui-2

Serkan,

 

What Ant targets are you running?  Post a link to the console output including the ant command.

 

I’m not sure why you say the mirror and file are broken.  What errors are you getting that indicate that it is broken?

 

-Alex

 

From: Serkan Taş <[hidden email]>
Reply-To: "[hidden email]" <[hidden email]>
Date: Monday, December 17, 2018 at 12:52 PM
To: "[hidden email]" <[hidden email]>
Subject: Re: compiler is broken

 

Hi,

When I downloaded the zip file from the link https://www-eu.apache.org/dist/flex/flexunit/4.2.0/binaries/apache-flex-flexunit-4.2.0-4.12.0-bin.zip
and put it into the folder royale-asjs/in, I expected the compiler should not delete, bud done so.

Two problems here:

1. The mirror and the file in apache is somehow broken :(e.g) http://www.apache.org/dyn/closer.lua/flex/flexunit/4.2.0/binaries/apache-flex-flexunit-4.2.0-4.12.0-bin.zip
2. File are deleted and downloaded each time during the build.

May give some idea.

It is not blocking me for now as I am using nightly builds unit I find a fix.

Thanks,
Serkan

16.12.2018 22:53 tarihinde Serkan Taş yazdı:

This time it is ok, I tired https://www-eu.apache.org/dist/flex/flexunit/4.2.0/binaries/apache-flex-flexunit-4.2.0-4.12.0-bin.zip

Thanks,
Serkan

16.12.2018 22:42 tarihinde Serkan Taş yazdı:

The link is not working Alex, just 16K is downloaded may be it is related with my environment.

Thanks,
Serkan

16.12.2018 10:04 tarihinde Alex Harui yazdı:

Hmm.  Maybe the cgi isn’t working.

 

Try: http://www.apache.org/dyn/closer.lua/flex/flexunit/4.2.0/binaries/apache-flex-flexunit-4.2.0-4.12.0-bin.zip

 

HTH,

-Alex

 

From: Serkan Taş [hidden email]
Reply-To: [hidden email] [hidden email]
Date: Saturday, December 15, 2018 at 3:13 AM
To: [hidden email] [hidden email]
Subject: Re: compiler is broken

 

I guess mirror is broken, is it possible to set not to use mirror ?

14.12.2018 09:39 tarihinde Piotr Zarzycki yazdı:

To me the other solution was as well downloading that file and setup one of the environment variable CACHE - It always being checked during compilation whether file exists there. If not we are trying to download it. 

 

Find that variable if anything won't work. 

 

Thanks, Piotr

 

czw., 13 gru 2018 o 23:17 Alex Harui <[hidden email]> napisał(a):

Usually, your default browser cache, but sometimes clearing the Internet Explorer cache (even if you don’t use Internet Explorer) can help.

 

Try downloading the file manually by clicking that link in a browser and run a checksum on the results and see you get something that can be unzipped.

 

HTH,

-Alex

 

From: Serkan Taş <[hidden email]>
Reply-To: "[hidden email]" <[hidden email]>
Date: Thursday, December 13, 2018 at 1:56 PM
To: "[hidden email]" <[hidden email]>
Subject: Re: compiler is broken

 

Hi Alex,

Which browser cache should be cleaned ?

Here is the download command from log :

download_using_mirror:
      [get] Getting: http://www.apache.org/dyn/mirrors/mirrors.cgi/flex/flexunit/4.2.0/binaries/apache-flex-flexunit-4.2.0-4.12.0-bin.zip?asjson=true
      [get] To: D:\dev\royale-emulation-works\github\royale-asjs\frameworks\mirror.json
      [get] .

check_mirror_json:

use_mirror:
   [delete] Deleting: D:\dev\royale-emulation-works\github\royale-asjs\frameworks\mirror.json
     [echo] Using mirror: http://ftp.itu.edu.tr/Mirror/Apache/
      [get] Getting: http://ftp.itu.edu.tr/Mirror/Apache/flex/flexunit/4.2.0/binaries/apache-flex-flexunit-4.2.0-4.12.0-bin.zip
      [get] To: D:\dev\royale-emulation-works\github\royale-asjs\in\apache-flex-flexunit-4.2.0-4.12.0-bin.zip




And full log for reference : https://drive.google.com/open?id=14rWYkD--Dv89nw8H1lJ1Dymg4IQVznKg

Thanks,
Serkan

11.12.2018 22:09 tarihinde Alex Harui yazdı:

Hi Serkan,

 

I don’t think that has anything to do with the compiler.  FlexUnit is for ActionScript unit tests.  I suggest that you clear your browser cache.  Sometimes the download libraries use browser libraries and a bad version of a file will be in a browser cache.

 

HTH,

-Alex

 

From: Serkan Taş [hidden email]
Reply-To: [hidden email] [hidden email]
Date: Tuesday, December 11, 2018 at 11:05 AM
To: [hidden email] [hidden email]
Subject: compiler is broken

 

Hi,

When compiling royale I am getting error below. Any one has idea ?

Here is the end of the log :

get-from-cache-if-needed:
    [unzip] Expanding: D:\dev\royale-emulation-works\github\royale-asjs\in\apache-flex-flexunit-4.2.0-4.12.0-bin.zip into D:\dev\royale-emulation-works\github\royale-asjs\in\flexunit

BUILD FAILED
D:\dev\royale-emulation-works\github\royale-asjs\build.xml:193: The following error occurred while executing this line:
D:\dev\royale-emulation-works\github\royale-asjs\frameworks\build.xml:106: The following error occurred while executing this line:
D:\dev\royale-emulation-works\github\royale-asjs\frameworks\downloads.xml:110: Error while expanding D:\dev\royale-emulation-works\github\royale-asjs\in\apache-flex-flexunit-4.2.0-4.12.0-bin.zip
java.util.zip.ZipException: archive is not a ZIP archive
        at org.apache.tools.zip.ZipFile.positionAtEndOfCentralDirectoryRecord(ZipFile.java:775)
        at org.apache.tools.zip.ZipFile.positionAtCentralDirectory(ZipFile.java:711)
        at org.apache.tools.zip.ZipFile.populateFromCentralDirectory(ZipFile.java:456)
        at org.apache.tools.zip.ZipFile.<init>(ZipFile.java:216)
        at org.apache.tools.ant.taskdefs.Expand.expandFile(Expand.java:190)
        at org.apache.tools.ant.taskdefs.Expand.execute(Expand.java:157)
        at org.apache.tools.ant.UnknownElement.execute(UnknownElement.java:292)
        at sun.reflect.GeneratedMethodAccessor4.invoke(Unknown Source)
        at sun.reflect.DelegatingMethodAccessorImpl.invoke(DelegatingMethodAccessorImpl.java:43)
        at java.lang.reflect.Method.invoke(Method.java:498)
        at org.apache.tools.ant.dispatch.DispatchUtils.execute(DispatchUtils.java:99)
        at org.apache.tools.ant.Task.perform(Task.java:350)
        at org.apache.tools.ant.Target.execute(Target.java:449)
        at org.apache.tools.ant.Target.performTasks(Target.java:470)
        at org.apache.tools.ant.Project.executeSortedTargets(Project.java:1388)
        at org.apache.tools.ant.helper.SingleCheckExecutor.executeTargets(SingleCheckExecutor.java:36)
        at org.apache.tools.ant.Project.executeTargets(Project.java:1251)
        at org.apache.tools.ant.taskdefs.Ant.execute(Ant.java:437)
        at org.apache.tools.ant.UnknownElement.execute(UnknownElement.java:292)
        at sun.reflect.GeneratedMethodAccessor4.invoke(Unknown Source)
        at sun.reflect.DelegatingMethodAccessorImpl.invoke(DelegatingMethodAccessorImpl.java:43)
        at java.lang.reflect.Method.invoke(Method.java:498)
        at org.apache.tools.ant.dispatch.DispatchUtils.execute(DispatchUtils.java:99)
        at org.apache.tools.ant.Task.perform(Task.java:350)
        at org.apache.tools.ant.Target.execute(Target.java:449)
        at org.apache.tools.ant.Target.performTasks(Target.java:470)
        at org.apache.tools.ant.Project.executeSortedTargets(Project.java:1388)
        at org.apache.tools.ant.helper.SingleCheckExecutor.executeTargets(SingleCheckExecutor.java:36)
        at org.apache.tools.ant.Project.executeTargets(Project.java:1251)
        at org.apache.tools.ant.taskdefs.Ant.execute(Ant.java:437)
        at org.apache.tools.ant.UnknownElement.execute(UnknownElement.java:292)
        at sun.reflect.GeneratedMethodAccessor4.invoke(Unknown Source)
        at sun.reflect.DelegatingMethodAccessorImpl.invoke(DelegatingMethodAccessorImpl.java:43)
        at java.lang.reflect.Method.invoke(Method.java:498)
        at org.apache.tools.ant.dispatch.DispatchUtils.execute(DispatchUtils.java:99)
        at org.apache.tools.ant.Task.perform(Task.java:350)
        at org.apache.tools.ant.Target.execute(Target.java:449)
        at org.apache.tools.ant.Target.performTasks(Target.java:470)
        at org.apache.tools.ant.Project.executeSortedTargets(Project.java:1388)
        at org.apache.tools.ant.Project.executeTarget(Project.java:1361)
        at org.apache.tools.ant.helper.DefaultExecutor.executeTargets(DefaultExecutor.java:41)
        at org.apache.tools.ant.Project.executeTargets(Project.java:1251)
        at org.apache.tools.ant.Main.runBuild(Main.java:834)
        at org.apache.tools.ant.Main.startAnt(Main.java:223)
        at org.apache.tools.ant.launch.Launcher.run(Launcher.java:284)
        at org.apache.tools.ant.launch.Launcher.main(Launcher.java:101)

Total time: 3 minutes 44 seconds


Thanks,
Serkan


 


 

--

Piotr Zarzycki 

Patreon: https://www.patreon.com/piotrzarzycki




 

 



Reply | Threaded
Open this post in threaded view
|

Re: compiler is broken

Serkan Taş
Hi Alex,

Here is the link of the log file including the build command : https://drive.google.com/open?id=1i_4_0m0oVb06_N2ymFpbv14Dcs71KNR9

Why I think mirror is broken ?

When I open the link :

http://www.apache.org/dyn/closer.lua/flex/flexunit/4.2.0/binaries/apache-flex-flexunit-4.2.0-4.12.0-bin.zip


I see the links for the file
apache-flex-flexunit-4.2.0-4.12.0-bin.zip

When try to download with right-click-save-as for
http://ftp.itu.edu.tr/Mirror/Apache/flex/flexunit/4.2.0/binaries/apache-flex-flexunit-4.2.0-4.12.0-bin.zip, I get file not downloaded.

When try to download with right-click-save-as for


ftp://ftp.itu.edu.tr/Mirror/Apache/flex/flexunit/4.2.0/binaries/apache-flex-flexunit-4.2.0-4.12.0-bin.zip
or
https://www-us.apache.org/dist/flex/flexunit/4.2.0/binaries/apache-flex-flexunit-4.2.0-4.12.0-bin.zip 
or

https://www-eu.apache.org/dist/flex/flexunit/4.2.0/binaries/apache-flex-flexunit-4.2.0-4.12.0-bin.zip

I get file downloaded completely.

But the compiler uses the first one.

Let me know it you need more information.

Thanks,
Serkan

18.12.2018 01:33 tarihinde Alex Harui yazdı:

Serkan,

 

What Ant targets are you running?  Post a link to the console output including the ant command.

 

I’m not sure why you say the mirror and file are broken.  What errors are you getting that indicate that it is broken?

 

-Alex

 

From: Serkan Taş [hidden email]
Reply-To: [hidden email] [hidden email]
Date: Monday, December 17, 2018 at 12:52 PM
To: [hidden email] [hidden email]
Subject: Re: compiler is broken

 

Hi,

When I downloaded the zip file from the link https://www-eu.apache.org/dist/flex/flexunit/4.2.0/binaries/apache-flex-flexunit-4.2.0-4.12.0-bin.zip
and put it into the folder royale-asjs/in, I expected the compiler should not delete, bud done so.

Two problems here:

1. The mirror and the file in apache is somehow broken :(e.g) http://www.apache.org/dyn/closer.lua/flex/flexunit/4.2.0/binaries/apache-flex-flexunit-4.2.0-4.12.0-bin.zip
2. File are deleted and downloaded each time during the build.

May give some idea.

It is not blocking me for now as I am using nightly builds unit I find a fix.

Thanks,
Serkan

16.12.2018 22:53 tarihinde Serkan Taş yazdı:

This time it is ok, I tired https://www-eu.apache.org/dist/flex/flexunit/4.2.0/binaries/apache-flex-flexunit-4.2.0-4.12.0-bin.zip

Thanks,
Serkan

16.12.2018 22:42 tarihinde Serkan Taş yazdı:

The link is not working Alex, just 16K is downloaded may be it is related with my environment.

Thanks,
Serkan

16.12.2018 10:04 tarihinde Alex Harui yazdı:

Hmm.  Maybe the cgi isn’t working.

 

Try: http://www.apache.org/dyn/closer.lua/flex/flexunit/4.2.0/binaries/apache-flex-flexunit-4.2.0-4.12.0-bin.zip

 

HTH,

-Alex

 

From: Serkan Taş [hidden email]
Reply-To: [hidden email] [hidden email]
Date: Saturday, December 15, 2018 at 3:13 AM
To: [hidden email] [hidden email]
Subject: Re: compiler is broken

 

I guess mirror is broken, is it possible to set not to use mirror ?

14.12.2018 09:39 tarihinde Piotr Zarzycki yazdı:

To me the other solution was as well downloading that file and setup one of the environment variable CACHE - It always being checked during compilation whether file exists there. If not we are trying to download it. 

 

Find that variable if anything won't work. 

 

Thanks, Piotr

 

czw., 13 gru 2018 o 23:17 Alex Harui <[hidden email]> napisał(a):

Usually, your default browser cache, but sometimes clearing the Internet Explorer cache (even if you don’t use Internet Explorer) can help.

 

Try downloading the file manually by clicking that link in a browser and run a checksum on the results and see you get something that can be unzipped.

 

HTH,

-Alex

 

From: Serkan Taş <[hidden email]>
Reply-To: "[hidden email]" <[hidden email]>
Date: Thursday, December 13, 2018 at 1:56 PM
To: "[hidden email]" <[hidden email]>
Subject: Re: compiler is broken

 

Hi Alex,

Which browser cache should be cleaned ?

Here is the download command from log :

download_using_mirror:
      [get] Getting: http://www.apache.org/dyn/mirrors/mirrors.cgi/flex/flexunit/4.2.0/binaries/apache-flex-flexunit-4.2.0-4.12.0-bin.zip?asjson=true
      [get] To: D:\dev\royale-emulation-works\github\royale-asjs\frameworks\mirror.json
      [get] .

check_mirror_json:

use_mirror:
   [delete] Deleting: D:\dev\royale-emulation-works\github\royale-asjs\frameworks\mirror.json
     [echo] Using mirror: http://ftp.itu.edu.tr/Mirror/Apache/
      [get] Getting: http://ftp.itu.edu.tr/Mirror/Apache/flex/flexunit/4.2.0/binaries/apache-flex-flexunit-4.2.0-4.12.0-bin.zip
      [get] To: D:\dev\royale-emulation-works\github\royale-asjs\in\apache-flex-flexunit-4.2.0-4.12.0-bin.zip




And full log for reference : https://drive.google.com/open?id=14rWYkD--Dv89nw8H1lJ1Dymg4IQVznKg

Thanks,
Serkan

11.12.2018 22:09 tarihinde Alex Harui yazdı:

Hi Serkan,

 

I don’t think that has anything to do with the compiler.  FlexUnit is for ActionScript unit tests.  I suggest that you clear your browser cache.  Sometimes the download libraries use browser libraries and a bad version of a file will be in a browser cache.

 

HTH,

-Alex

 

From: Serkan Taş [hidden email]
Reply-To: [hidden email] [hidden email]
Date: Tuesday, December 11, 2018 at 11:05 AM
To: [hidden email] [hidden email]
Subject: compiler is broken

 

Hi,

When compiling royale I am getting error below. Any one has idea ?

Here is the end of the log :

get-from-cache-if-needed:
    [unzip] Expanding: D:\dev\royale-emulation-works\github\royale-asjs\in\apache-flex-flexunit-4.2.0-4.12.0-bin.zip into D:\dev\royale-emulation-works\github\royale-asjs\in\flexunit

BUILD FAILED
D:\dev\royale-emulation-works\github\royale-asjs\build.xml:193: The following error occurred while executing this line:
D:\dev\royale-emulation-works\github\royale-asjs\frameworks\build.xml:106: The following error occurred while executing this line:
D:\dev\royale-emulation-works\github\royale-asjs\frameworks\downloads.xml:110: Error while expanding D:\dev\royale-emulation-works\github\royale-asjs\in\apache-flex-flexunit-4.2.0-4.12.0-bin.zip
java.util.zip.ZipException: archive is not a ZIP archive
        at org.apache.tools.zip.ZipFile.positionAtEndOfCentralDirectoryRecord(ZipFile.java:775)
        at org.apache.tools.zip.ZipFile.positionAtCentralDirectory(ZipFile.java:711)
        at org.apache.tools.zip.ZipFile.populateFromCentralDirectory(ZipFile.java:456)
        at org.apache.tools.zip.ZipFile.<init>(ZipFile.java:216)
        at org.apache.tools.ant.taskdefs.Expand.expandFile(Expand.java:190)
        at org.apache.tools.ant.taskdefs.Expand.execute(Expand.java:157)
        at org.apache.tools.ant.UnknownElement.execute(UnknownElement.java:292)
        at sun.reflect.GeneratedMethodAccessor4.invoke(Unknown Source)
        at sun.reflect.DelegatingMethodAccessorImpl.invoke(DelegatingMethodAccessorImpl.java:43)
        at java.lang.reflect.Method.invoke(Method.java:498)
        at org.apache.tools.ant.dispatch.DispatchUtils.execute(DispatchUtils.java:99)
        at org.apache.tools.ant.Task.perform(Task.java:350)
        at org.apache.tools.ant.Target.execute(Target.java:449)
        at org.apache.tools.ant.Target.performTasks(Target.java:470)
        at org.apache.tools.ant.Project.executeSortedTargets(Project.java:1388)
        at org.apache.tools.ant.helper.SingleCheckExecutor.executeTargets(SingleCheckExecutor.java:36)
        at org.apache.tools.ant.Project.executeTargets(Project.java:1251)
        at org.apache.tools.ant.taskdefs.Ant.execute(Ant.java:437)
        at org.apache.tools.ant.UnknownElement.execute(UnknownElement.java:292)
        at sun.reflect.GeneratedMethodAccessor4.invoke(Unknown Source)
        at sun.reflect.DelegatingMethodAccessorImpl.invoke(DelegatingMethodAccessorImpl.java:43)
        at java.lang.reflect.Method.invoke(Method.java:498)
        at org.apache.tools.ant.dispatch.DispatchUtils.execute(DispatchUtils.java:99)
        at org.apache.tools.ant.Task.perform(Task.java:350)
        at org.apache.tools.ant.Target.execute(Target.java:449)
        at org.apache.tools.ant.Target.performTasks(Target.java:470)
        at org.apache.tools.ant.Project.executeSortedTargets(Project.java:1388)
        at org.apache.tools.ant.helper.SingleCheckExecutor.executeTargets(SingleCheckExecutor.java:36)
        at org.apache.tools.ant.Project.executeTargets(Project.java:1251)
        at org.apache.tools.ant.taskdefs.Ant.execute(Ant.java:437)
        at org.apache.tools.ant.UnknownElement.execute(UnknownElement.java:292)
        at sun.reflect.GeneratedMethodAccessor4.invoke(Unknown Source)
        at sun.reflect.DelegatingMethodAccessorImpl.invoke(DelegatingMethodAccessorImpl.java:43)
        at java.lang.reflect.Method.invoke(Method.java:498)
        at org.apache.tools.ant.dispatch.DispatchUtils.execute(DispatchUtils.java:99)
        at org.apache.tools.ant.Task.perform(Task.java:350)
        at org.apache.tools.ant.Target.execute(Target.java:449)
        at org.apache.tools.ant.Target.performTasks(Target.java:470)
        at org.apache.tools.ant.Project.executeSortedTargets(Project.java:1388)
        at org.apache.tools.ant.Project.executeTarget(Project.java:1361)
        at org.apache.tools.ant.helper.DefaultExecutor.executeTargets(DefaultExecutor.java:41)
        at org.apache.tools.ant.Project.executeTargets(Project.java:1251)
        at org.apache.tools.ant.Main.runBuild(Main.java:834)
        at org.apache.tools.ant.Main.startAnt(Main.java:223)
        at org.apache.tools.ant.launch.Launcher.run(Launcher.java:284)
        at org.apache.tools.ant.launch.Launcher.main(Launcher.java:101)

Total time: 3 minutes 44 seconds


Thanks,
Serkan


 


 

--

Piotr Zarzycki 

Patreon: https://www.patreon.com/piotrzarzycki




 

 




Reply | Threaded
Open this post in threaded view
|

Re: compiler is broken

Alex Harui-2

Serkan,

 

The build commands are in some batch file.  I cannot tell what is in it, but it appears to be calling the super-clean target which deletes the downloads.

 

Again, this is the risk and inefficiencies of using a custom build process.

 

-Alex

 

From: Serkan Taş <[hidden email]>
Reply-To: "[hidden email]" <[hidden email]>
Date: Tuesday, December 18, 2018 at 10:36 AM
To: "[hidden email]" <[hidden email]>
Subject: Re: compiler is broken

 

Hi Alex,

Here is the link of the log file including the build command : https://drive.google.com/open?id=1i_4_0m0oVb06_N2ymFpbv14Dcs71KNR9

Why I think mirror is broken ?

When I open the link :
http://www.apache.org/dyn/closer.lua/flex/flexunit/4.2.0/binaries/apache-flex-flexunit-4.2.0-4.12.0-bin.zip


I see the links for the file apache-flex-flexunit-4.2.0-4.12.0-bin.zip

When try to download with right-click-save-as for http://ftp.itu.edu.tr/Mirror/Apache/flex/flexunit/4.2.0/binaries/apache-flex-flexunit-4.2.0-4.12.0-bin.zip, I get file not downloaded.

When try to download with right-click-save-as for

ftp://ftp.itu.edu.tr/Mirror/Apache/flex/flexunit/4.2.0/binaries/apache-flex-flexunit-4.2.0-4.12.0-bin.zip
or
https://www-us.apache.org/dist/flex/flexunit/4.2.0/binaries/apache-flex-flexunit-4.2.0-4.12.0-bin.zip 
or
https://www-eu.apache.org/dist/flex/flexunit/4.2.0/binaries/apache-flex-flexunit-4.2.0-4.12.0-bin.zip

I get file downloaded completely.

But the compiler uses the first one.

Let me know it you need more information.

Thanks,
Serkan

18.12.2018 01:33 tarihinde Alex Harui yazdı:

Serkan,

 

What Ant targets are you running?  Post a link to the console output including the ant command.

 

I’m not sure why you say the mirror and file are broken.  What errors are you getting that indicate that it is broken?

 

-Alex

 

From: Serkan Taş [hidden email]
Reply-To: [hidden email] [hidden email]
Date: Monday, December 17, 2018 at 12:52 PM
To: [hidden email] [hidden email]
Subject: Re: compiler is broken

 

Hi,

When I downloaded the zip file from the link https://www-eu.apache.org/dist/flex/flexunit/4.2.0/binaries/apache-flex-flexunit-4.2.0-4.12.0-bin.zip
and put it into the folder royale-asjs/in, I expected the compiler should not delete, bud done so.

Two problems here:

1. The mirror and the file in apache is somehow broken :(e.g) http://www.apache.org/dyn/closer.lua/flex/flexunit/4.2.0/binaries/apache-flex-flexunit-4.2.0-4.12.0-bin.zip
2. File are deleted and downloaded each time during the build.

May give some idea.

It is not blocking me for now as I am using nightly builds unit I find a fix.

Thanks,
Serkan

16.12.2018 22:53 tarihinde Serkan Taş yazdı:

This time it is ok, I tired https://www-eu.apache.org/dist/flex/flexunit/4.2.0/binaries/apache-flex-flexunit-4.2.0-4.12.0-bin.zip

Thanks,
Serkan

16.12.2018 22:42 tarihinde Serkan Taş yazdı:

The link is not working Alex, just 16K is downloaded may be it is related with my environment.

Thanks,
Serkan

16.12.2018 10:04 tarihinde Alex Harui yazdı:

Hmm.  Maybe the cgi isn’t working.

 

Try: http://www.apache.org/dyn/closer.lua/flex/flexunit/4.2.0/binaries/apache-flex-flexunit-4.2.0-4.12.0-bin.zip

 

HTH,

-Alex

 

From: Serkan Taş [hidden email]
Reply-To: [hidden email] [hidden email]
Date: Saturday, December 15, 2018 at 3:13 AM
To: [hidden email] [hidden email]
Subject: Re: compiler is broken

 

I guess mirror is broken, is it possible to set not to use mirror ?

14.12.2018 09:39 tarihinde Piotr Zarzycki yazdı:

To me the other solution was as well downloading that file and setup one of the environment variable CACHE - It always being checked during compilation whether file exists there. If not we are trying to download it. 

 

Find that variable if anything won't work. 

 

Thanks, Piotr

 

czw., 13 gru 2018 o 23:17 Alex Harui <[hidden email]> napisał(a):

Usually, your default browser cache, but sometimes clearing the Internet Explorer cache (even if you don’t use Internet Explorer) can help.

 

Try downloading the file manually by clicking that link in a browser and run a checksum on the results and see you get something that can be unzipped.

 

HTH,

-Alex

 

From: Serkan Taş <[hidden email]>
Reply-To: "[hidden email]" <[hidden email]>
Date: Thursday, December 13, 2018 at 1:56 PM
To: "[hidden email]" <[hidden email]>
Subject: Re: compiler is broken

 

Hi Alex,

Which browser cache should be cleaned ?

Here is the download command from log :

download_using_mirror:
      [get] Getting: http://www.apache.org/dyn/mirrors/mirrors.cgi/flex/flexunit/4.2.0/binaries/apache-flex-flexunit-4.2.0-4.12.0-bin.zip?asjson=true
      [get] To: D:\dev\royale-emulation-works\github\royale-asjs\frameworks\mirror.json
      [get] .

check_mirror_json:

use_mirror:
   [delete] Deleting: D:\dev\royale-emulation-works\github\royale-asjs\frameworks\mirror.json
     [echo] Using mirror: http://ftp.itu.edu.tr/Mirror/Apache/
      [get] Getting: http://ftp.itu.edu.tr/Mirror/Apache/flex/flexunit/4.2.0/binaries/apache-flex-flexunit-4.2.0-4.12.0-bin.zip
      [get] To: D:\dev\royale-emulation-works\github\royale-asjs\in\apache-flex-flexunit-4.2.0-4.12.0-bin.zip




And full log for reference : https://drive.google.com/open?id=14rWYkD--Dv89nw8H1lJ1Dymg4IQVznKg

Thanks,
Serkan

11.12.2018 22:09 tarihinde Alex Harui yazdı:

Hi Serkan,

 

I don’t think that has anything to do with the compiler.  FlexUnit is for ActionScript unit tests.  I suggest that you clear your browser cache.  Sometimes the download libraries use browser libraries and a bad version of a file will be in a browser cache.

 

HTH,

-Alex

 

From: Serkan Taş [hidden email]
Reply-To: [hidden email] [hidden email]
Date: Tuesday, December 11, 2018 at 11:05 AM
To: [hidden email] [hidden email]
Subject: compiler is broken

 

Hi,

When compiling royale I am getting error below. Any one has idea ?

Here is the end of the log :

get-from-cache-if-needed:
    [unzip] Expanding: D:\dev\royale-emulation-works\github\royale-asjs\in\apache-flex-flexunit-4.2.0-4.12.0-bin.zip into D:\dev\royale-emulation-works\github\royale-asjs\in\flexunit

BUILD FAILED
D:\dev\royale-emulation-works\github\royale-asjs\build.xml:193: The following error occurred while executing this line:
D:\dev\royale-emulation-works\github\royale-asjs\frameworks\build.xml:106: The following error occurred while executing this line:
D:\dev\royale-emulation-works\github\royale-asjs\frameworks\downloads.xml:110: Error while expanding D:\dev\royale-emulation-works\github\royale-asjs\in\apache-flex-flexunit-4.2.0-4.12.0-bin.zip
java.util.zip.ZipException: archive is not a ZIP archive
        at org.apache.tools.zip.ZipFile.positionAtEndOfCentralDirectoryRecord(ZipFile.java:775)
        at org.apache.tools.zip.ZipFile.positionAtCentralDirectory(ZipFile.java:711)
        at org.apache.tools.zip.ZipFile.populateFromCentralDirectory(ZipFile.java:456)
        at org.apache.tools.zip.ZipFile.<init>(ZipFile.java:216)
        at org.apache.tools.ant.taskdefs.Expand.expandFile(Expand.java:190)
        at org.apache.tools.ant.taskdefs.Expand.execute(Expand.java:157)
        at org.apache.tools.ant.UnknownElement.execute(UnknownElement.java:292)
        at sun.reflect.GeneratedMethodAccessor4.invoke(Unknown Source)
        at sun.reflect.DelegatingMethodAccessorImpl.invoke(DelegatingMethodAccessorImpl.java:43)
        at java.lang.reflect.Method.invoke(Method.java:498)
        at org.apache.tools.ant.dispatch.DispatchUtils.execute(DispatchUtils.java:99)
        at org.apache.tools.ant.Task.perform(Task.java:350)
        at org.apache.tools.ant.Target.execute(Target.java:449)
        at org.apache.tools.ant.Target.performTasks(Target.java:470)
        at org.apache.tools.ant.Project.executeSortedTargets(Project.java:1388)
        at org.apache.tools.ant.helper.SingleCheckExecutor.executeTargets(SingleCheckExecutor.java:36)
        at org.apache.tools.ant.Project.executeTargets(Project.java:1251)
        at org.apache.tools.ant.taskdefs.Ant.execute(Ant.java:437)
        at org.apache.tools.ant.UnknownElement.execute(UnknownElement.java:292)
        at sun.reflect.GeneratedMethodAccessor4.invoke(Unknown Source)
        at sun.reflect.DelegatingMethodAccessorImpl.invoke(DelegatingMethodAccessorImpl.java:43)
        at java.lang.reflect.Method.invoke(Method.java:498)
        at org.apache.tools.ant.dispatch.DispatchUtils.execute(DispatchUtils.java:99)
        at org.apache.tools.ant.Task.perform(Task.java:350)
        at org.apache.tools.ant.Target.execute(Target.java:449)
        at org.apache.tools.ant.Target.performTasks(Target.java:470)
        at org.apache.tools.ant.Project.executeSortedTargets(Project.java:1388)
        at org.apache.tools.ant.helper.SingleCheckExecutor.executeTargets(SingleCheckExecutor.java:36)
        at org.apache.tools.ant.Project.executeTargets(Project.java:1251)
        at org.apache.tools.ant.taskdefs.Ant.execute(Ant.java:437)
        at org.apache.tools.ant.UnknownElement.execute(UnknownElement.java:292)
        at sun.reflect.GeneratedMethodAccessor4.invoke(Unknown Source)
        at sun.reflect.DelegatingMethodAccessorImpl.invoke(DelegatingMethodAccessorImpl.java:43)
        at java.lang.reflect.Method.invoke(Method.java:498)
        at org.apache.tools.ant.dispatch.DispatchUtils.execute(DispatchUtils.java:99)
        at org.apache.tools.ant.Task.perform(Task.java:350)
        at org.apache.tools.ant.Target.execute(Target.java:449)
        at org.apache.tools.ant.Target.performTasks(Target.java:470)
        at org.apache.tools.ant.Project.executeSortedTargets(Project.java:1388)
        at org.apache.tools.ant.Project.executeTarget(Project.java:1361)
        at org.apache.tools.ant.helper.DefaultExecutor.executeTargets(DefaultExecutor.java:41)
        at org.apache.tools.ant.Project.executeTargets(Project.java:1251)
        at org.apache.tools.ant.Main.runBuild(Main.java:834)
        at org.apache.tools.ant.Main.startAnt(Main.java:223)
        at org.apache.tools.ant.launch.Launcher.run(Launcher.java:284)
        at org.apache.tools.ant.launch.Launcher.main(Launcher.java:101)

Total time: 3 minutes 44 seconds


Thanks,
Serkan



 


 

--

Piotr Zarzycki 

Patreon: https://www.patreon.com/piotrzarzycki





 

 






Reply | Threaded
Open this post in threaded view
|

Re: compiler is broken

Serkan Taş
Alex, I know your thoughts about custom build process, and trying to resolve it.

But it needs some time to understand and implement, I am working on.

Thanks,
Serkan

18.12.2018 22:11 tarihinde Alex Harui yazdı:

Serkan,

 

The build commands are in some batch file.  I cannot tell what is in it, but it appears to be calling the super-clean target which deletes the downloads.

 

Again, this is the risk and inefficiencies of using a custom build process.

 

-Alex

 

From: Serkan Taş [hidden email]
Reply-To: [hidden email] [hidden email]
Date: Tuesday, December 18, 2018 at 10:36 AM
To: [hidden email] [hidden email]
Subject: Re: compiler is broken

 

Hi Alex,

Here is the link of the log file including the build command : https://drive.google.com/open?id=1i_4_0m0oVb06_N2ymFpbv14Dcs71KNR9

Why I think mirror is broken ?

When I open the link :
http://www.apache.org/dyn/closer.lua/flex/flexunit/4.2.0/binaries/apache-flex-flexunit-4.2.0-4.12.0-bin.zip


I see the links for the file apache-flex-flexunit-4.2.0-4.12.0-bin.zip

When try to download with right-click-save-as for http://ftp.itu.edu.tr/Mirror/Apache/flex/flexunit/4.2.0/binaries/apache-flex-flexunit-4.2.0-4.12.0-bin.zip, I get file not downloaded.

When try to download with right-click-save-as for

ftp://ftp.itu.edu.tr/Mirror/Apache/flex/flexunit/4.2.0/binaries/apache-flex-flexunit-4.2.0-4.12.0-bin.zip
or
https://www-us.apache.org/dist/flex/flexunit/4.2.0/binaries/apache-flex-flexunit-4.2.0-4.12.0-bin.zip 
or
https://www-eu.apache.org/dist/flex/flexunit/4.2.0/binaries/apache-flex-flexunit-4.2.0-4.12.0-bin.zip

I get file downloaded completely.

But the compiler uses the first one.

Let me know it you need more information.

Thanks,
Serkan

18.12.2018 01:33 tarihinde Alex Harui yazdı:

Serkan,

 

What Ant targets are you running?  Post a link to the console output including the ant command.

 

I’m not sure why you say the mirror and file are broken.  What errors are you getting that indicate that it is broken?

 

-Alex

 

From: Serkan Taş [hidden email]
Reply-To: [hidden email] [hidden email]
Date: Monday, December 17, 2018 at 12:52 PM
To: [hidden email] [hidden email]
Subject: Re: compiler is broken

 

Hi,

When I downloaded the zip file from the link https://www-eu.apache.org/dist/flex/flexunit/4.2.0/binaries/apache-flex-flexunit-4.2.0-4.12.0-bin.zip
and put it into the folder royale-asjs/in, I expected the compiler should not delete, bud done so.

Two problems here:

1. The mirror and the file in apache is somehow broken :(e.g) http://www.apache.org/dyn/closer.lua/flex/flexunit/4.2.0/binaries/apache-flex-flexunit-4.2.0-4.12.0-bin.zip
2. File are deleted and downloaded each time during the build.

May give some idea.

It is not blocking me for now as I am using nightly builds unit I find a fix.

Thanks,
Serkan

16.12.2018 22:53 tarihinde Serkan Taş yazdı:

This time it is ok, I tired https://www-eu.apache.org/dist/flex/flexunit/4.2.0/binaries/apache-flex-flexunit-4.2.0-4.12.0-bin.zip

Thanks,
Serkan

16.12.2018 22:42 tarihinde Serkan Taş yazdı:

The link is not working Alex, just 16K is downloaded may be it is related with my environment.

Thanks,
Serkan

16.12.2018 10:04 tarihinde Alex Harui yazdı:

Hmm.  Maybe the cgi isn’t working.

 

Try: http://www.apache.org/dyn/closer.lua/flex/flexunit/4.2.0/binaries/apache-flex-flexunit-4.2.0-4.12.0-bin.zip

 

HTH,

-Alex

 

From: Serkan Taş [hidden email]
Reply-To: [hidden email] [hidden email]
Date: Saturday, December 15, 2018 at 3:13 AM
To: [hidden email] [hidden email]
Subject: Re: compiler is broken

 

I guess mirror is broken, is it possible to set not to use mirror ?

14.12.2018 09:39 tarihinde Piotr Zarzycki yazdı:

To me the other solution was as well downloading that file and setup one of the environment variable CACHE - It always being checked during compilation whether file exists there. If not we are trying to download it. 

 

Find that variable if anything won't work. 

 

Thanks, Piotr

 

czw., 13 gru 2018 o 23:17 Alex Harui <[hidden email]> napisał(a):

Usually, your default browser cache, but sometimes clearing the Internet Explorer cache (even if you don’t use Internet Explorer) can help.

 

Try downloading the file manually by clicking that link in a browser and run a checksum on the results and see you get something that can be unzipped.

 

HTH,

-Alex

 

From: Serkan Taş <[hidden email]>
Reply-To: "[hidden email]" <[hidden email]>
Date: Thursday, December 13, 2018 at 1:56 PM
To: "[hidden email]" <[hidden email]>
Subject: Re: compiler is broken

 

Hi Alex,

Which browser cache should be cleaned ?

Here is the download command from log :

download_using_mirror:
      [get] Getting: http://www.apache.org/dyn/mirrors/mirrors.cgi/flex/flexunit/4.2.0/binaries/apache-flex-flexunit-4.2.0-4.12.0-bin.zip?asjson=true
      [get] To: D:\dev\royale-emulation-works\github\royale-asjs\frameworks\mirror.json
      [get] .

check_mirror_json:

use_mirror:
   [delete] Deleting: D:\dev\royale-emulation-works\github\royale-asjs\frameworks\mirror.json
     [echo] Using mirror: http://ftp.itu.edu.tr/Mirror/Apache/
      [get] Getting: http://ftp.itu.edu.tr/Mirror/Apache/flex/flexunit/4.2.0/binaries/apache-flex-flexunit-4.2.0-4.12.0-bin.zip
      [get] To: D:\dev\royale-emulation-works\github\royale-asjs\in\apache-flex-flexunit-4.2.0-4.12.0-bin.zip




And full log for reference : https://drive.google.com/open?id=14rWYkD--Dv89nw8H1lJ1Dymg4IQVznKg

Thanks,
Serkan

11.12.2018 22:09 tarihinde Alex Harui yazdı:

Hi Serkan,

 

I don’t think that has anything to do with the compiler.  FlexUnit is for ActionScript unit tests.  I suggest that you clear your browser cache.  Sometimes the download libraries use browser libraries and a bad version of a file will be in a browser cache.

 

HTH,

-Alex

 

From: Serkan Taş [hidden email]
Reply-To: [hidden email] [hidden email]
Date: Tuesday, December 11, 2018 at 11:05 AM
To: [hidden email] [hidden email]
Subject: compiler is broken

 

Hi,

When compiling royale I am getting error below. Any one has idea ?

Here is the end of the log :

get-from-cache-if-needed:
    [unzip] Expanding: D:\dev\royale-emulation-works\github\royale-asjs\in\apache-flex-flexunit-4.2.0-4.12.0-bin.zip into D:\dev\royale-emulation-works\github\royale-asjs\in\flexunit

BUILD FAILED
D:\dev\royale-emulation-works\github\royale-asjs\build.xml:193: The following error occurred while executing this line:
D:\dev\royale-emulation-works\github\royale-asjs\frameworks\build.xml:106: The following error occurred while executing this line:
D:\dev\royale-emulation-works\github\royale-asjs\frameworks\downloads.xml:110: Error while expanding D:\dev\royale-emulation-works\github\royale-asjs\in\apache-flex-flexunit-4.2.0-4.12.0-bin.zip
java.util.zip.ZipException: archive is not a ZIP archive
        at org.apache.tools.zip.ZipFile.positionAtEndOfCentralDirectoryRecord(ZipFile.java:775)
        at org.apache.tools.zip.ZipFile.positionAtCentralDirectory(ZipFile.java:711)
        at org.apache.tools.zip.ZipFile.populateFromCentralDirectory(ZipFile.java:456)
        at org.apache.tools.zip.ZipFile.<init>(ZipFile.java:216)
        at org.apache.tools.ant.taskdefs.Expand.expandFile(Expand.java:190)
        at org.apache.tools.ant.taskdefs.Expand.execute(Expand.java:157)
        at org.apache.tools.ant.UnknownElement.execute(UnknownElement.java:292)
        at sun.reflect.GeneratedMethodAccessor4.invoke(Unknown Source)
        at sun.reflect.DelegatingMethodAccessorImpl.invoke(DelegatingMethodAccessorImpl.java:43)
        at java.lang.reflect.Method.invoke(Method.java:498)
        at org.apache.tools.ant.dispatch.DispatchUtils.execute(DispatchUtils.java:99)
        at org.apache.tools.ant.Task.perform(Task.java:350)
        at org.apache.tools.ant.Target.execute(Target.java:449)
        at org.apache.tools.ant.Target.performTasks(Target.java:470)
        at org.apache.tools.ant.Project.executeSortedTargets(Project.java:1388)
        at org.apache.tools.ant.helper.SingleCheckExecutor.executeTargets(SingleCheckExecutor.java:36)
        at org.apache.tools.ant.Project.executeTargets(Project.java:1251)
        at org.apache.tools.ant.taskdefs.Ant.execute(Ant.java:437)
        at org.apache.tools.ant.UnknownElement.execute(UnknownElement.java:292)
        at sun.reflect.GeneratedMethodAccessor4.invoke(Unknown Source)
        at sun.reflect.DelegatingMethodAccessorImpl.invoke(DelegatingMethodAccessorImpl.java:43)
        at java.lang.reflect.Method.invoke(Method.java:498)
        at org.apache.tools.ant.dispatch.DispatchUtils.execute(DispatchUtils.java:99)
        at org.apache.tools.ant.Task.perform(Task.java:350)
        at org.apache.tools.ant.Target.execute(Target.java:449)
        at org.apache.tools.ant.Target.performTasks(Target.java:470)
        at org.apache.tools.ant.Project.executeSortedTargets(Project.java:1388)
        at org.apache.tools.ant.helper.SingleCheckExecutor.executeTargets(SingleCheckExecutor.java:36)
        at org.apache.tools.ant.Project.executeTargets(Project.java:1251)
        at org.apache.tools.ant.taskdefs.Ant.execute(Ant.java:437)
        at org.apache.tools.ant.UnknownElement.execute(UnknownElement.java:292)
        at sun.reflect.GeneratedMethodAccessor4.invoke(Unknown Source)
        at sun.reflect.DelegatingMethodAccessorImpl.invoke(DelegatingMethodAccessorImpl.java:43)
        at java.lang.reflect.Method.invoke(Method.java:498)
        at org.apache.tools.ant.dispatch.DispatchUtils.execute(DispatchUtils.java:99)
        at org.apache.tools.ant.Task.perform(Task.java:350)
        at org.apache.tools.ant.Target.execute(Target.java:449)
        at org.apache.tools.ant.Target.performTasks(Target.java:470)
        at org.apache.tools.ant.Project.executeSortedTargets(Project.java:1388)
        at org.apache.tools.ant.Project.executeTarget(Project.java:1361)
        at org.apache.tools.ant.helper.DefaultExecutor.executeTargets(DefaultExecutor.java:41)
        at org.apache.tools.ant.Project.executeTargets(Project.java:1251)
        at org.apache.tools.ant.Main.runBuild(Main.java:834)
        at org.apache.tools.ant.Main.startAnt(Main.java:223)
        at org.apache.tools.ant.launch.Launcher.run(Launcher.java:284)
        at org.apache.tools.ant.launch.Launcher.main(Launcher.java:101)

Total time: 3 minutes 44 seconds


Thanks,
Serkan



 


 

--

Piotr Zarzycki 

Patreon: https://www.patreon.com/piotrzarzycki





 

 







Reply | Threaded
Open this post in threaded view
|

Re: compiler is broken

Alex Harui-2

It seems like you have royale-asjs, royale-typedefs, and royale-compiler repos and are the batch file is trying to run Ant on it.  If you have that, you shouldn’t need everything in the batch file that comes before it, especially the Maven stuff.  Once you have the 3 repos, you should be able to run “ant” in any of them.

 

-Alex

 

From: Serkan Taş <[hidden email]>
Reply-To: "[hidden email]" <[hidden email]>
Date: Tuesday, December 18, 2018 at 11:15 AM
To: "[hidden email]" <[hidden email]>
Subject: Re: compiler is broken

 

Alex, I know your thoughts about custom build process, and trying to resolve it.

But it needs some time to understand and implement, I am working on.

Thanks,
Serkan

18.12.2018 22:11 tarihinde Alex Harui yazdı:

Serkan,

 

The build commands are in some batch file.  I cannot tell what is in it, but it appears to be calling the super-clean target which deletes the downloads.

 

Again, this is the risk and inefficiencies of using a custom build process.

 

-Alex

 

From: Serkan Taş [hidden email]
Reply-To: [hidden email] [hidden email]
Date: Tuesday, December 18, 2018 at 10:36 AM
To: [hidden email] [hidden email]
Subject: Re: compiler is broken

 

Hi Alex,

Here is the link of the log file including the build command : https://drive.google.com/open?id=1i_4_0m0oVb06_N2ymFpbv14Dcs71KNR9

Why I think mirror is broken ?

When I open the link :
http://www.apache.org/dyn/closer.lua/flex/flexunit/4.2.0/binaries/apache-flex-flexunit-4.2.0-4.12.0-bin.zip


I see the links for the file apache-flex-flexunit-4.2.0-4.12.0-bin.zip

When try to download with right-click-save-as for http://ftp.itu.edu.tr/Mirror/Apache/flex/flexunit/4.2.0/binaries/apache-flex-flexunit-4.2.0-4.12.0-bin.zip, I get file not downloaded.

When try to download with right-click-save-as for

ftp://ftp.itu.edu.tr/Mirror/Apache/flex/flexunit/4.2.0/binaries/apache-flex-flexunit-4.2.0-4.12.0-bin.zip
or
https://www-us.apache.org/dist/flex/flexunit/4.2.0/binaries/apache-flex-flexunit-4.2.0-4.12.0-bin.zip 
or
https://www-eu.apache.org/dist/flex/flexunit/4.2.0/binaries/apache-flex-flexunit-4.2.0-4.12.0-bin.zip

I get file downloaded completely.

But the compiler uses the first one.

Let me know it you need more information.

Thanks,
Serkan

18.12.2018 01:33 tarihinde Alex Harui yazdı:

Serkan,

 

What Ant targets are you running?  Post a link to the console output including the ant command.

 

I’m not sure why you say the mirror and file are broken.  What errors are you getting that indicate that it is broken?

 

-Alex

 

From: Serkan Taş [hidden email]
Reply-To: [hidden email] [hidden email]
Date: Monday, December 17, 2018 at 12:52 PM
To: [hidden email] [hidden email]
Subject: Re: compiler is broken

 

Hi,

When I downloaded the zip file from the link https://www-eu.apache.org/dist/flex/flexunit/4.2.0/binaries/apache-flex-flexunit-4.2.0-4.12.0-bin.zip
and put it into the folder royale-asjs/in, I expected the compiler should not delete, bud done so.

Two problems here:

1. The mirror and the file in apache is somehow broken :(e.g) http://www.apache.org/dyn/closer.lua/flex/flexunit/4.2.0/binaries/apache-flex-flexunit-4.2.0-4.12.0-bin.zip
2. File are deleted and downloaded each time during the build.

May give some idea.

It is not blocking me for now as I am using nightly builds unit I find a fix.

Thanks,
Serkan

16.12.2018 22:53 tarihinde Serkan Taş yazdı:

This time it is ok, I tired https://www-eu.apache.org/dist/flex/flexunit/4.2.0/binaries/apache-flex-flexunit-4.2.0-4.12.0-bin.zip

Thanks,
Serkan

16.12.2018 22:42 tarihinde Serkan Taş yazdı:

The link is not working Alex, just 16K is downloaded may be it is related with my environment.

Thanks,
Serkan

16.12.2018 10:04 tarihinde Alex Harui yazdı:

Hmm.  Maybe the cgi isn’t working.

 

Try: http://www.apache.org/dyn/closer.lua/flex/flexunit/4.2.0/binaries/apache-flex-flexunit-4.2.0-4.12.0-bin.zip

 

HTH,

-Alex

 

From: Serkan Taş [hidden email]
Reply-To: [hidden email] [hidden email]
Date: Saturday, December 15, 2018 at 3:13 AM
To: [hidden email] [hidden email]
Subject: Re: compiler is broken

 

I guess mirror is broken, is it possible to set not to use mirror ?

14.12.2018 09:39 tarihinde Piotr Zarzycki yazdı:

To me the other solution was as well downloading that file and setup one of the environment variable CACHE - It always being checked during compilation whether file exists there. If not we are trying to download it. 

 

Find that variable if anything won't work. 

 

Thanks, Piotr

 

czw., 13 gru 2018 o 23:17 Alex Harui <[hidden email]> napisał(a):

Usually, your default browser cache, but sometimes clearing the Internet Explorer cache (even if you don’t use Internet Explorer) can help.

 

Try downloading the file manually by clicking that link in a browser and run a checksum on the results and see you get something that can be unzipped.

 

HTH,

-Alex

 

From: Serkan Taş <[hidden email]>
Reply-To: "[hidden email]" <[hidden email]>
Date: Thursday, December 13, 2018 at 1:56 PM
To: "[hidden email]" <[hidden email]>
Subject: Re: compiler is broken

 

Hi Alex,

Which browser cache should be cleaned ?

Here is the download command from log :

download_using_mirror:
      [get] Getting: http://www.apache.org/dyn/mirrors/mirrors.cgi/flex/flexunit/4.2.0/binaries/apache-flex-flexunit-4.2.0-4.12.0-bin.zip?asjson=true
      [get] To: D:\dev\royale-emulation-works\github\royale-asjs\frameworks\mirror.json
      [get] .

check_mirror_json:

use_mirror:
   [delete] Deleting: D:\dev\royale-emulation-works\github\royale-asjs\frameworks\mirror.json
     [echo] Using mirror: http://ftp.itu.edu.tr/Mirror/Apache/
      [get] Getting: http://ftp.itu.edu.tr/Mirror/Apache/flex/flexunit/4.2.0/binaries/apache-flex-flexunit-4.2.0-4.12.0-bin.zip
      [get] To: D:\dev\royale-emulation-works\github\royale-asjs\in\apache-flex-flexunit-4.2.0-4.12.0-bin.zip




And full log for reference : https://drive.google.com/open?id=14rWYkD--Dv89nw8H1lJ1Dymg4IQVznKg

Thanks,
Serkan

11.12.2018 22:09 tarihinde Alex Harui yazdı:

Hi Serkan,

 

I don’t think that has anything to do with the compiler.  FlexUnit is for ActionScript unit tests.  I suggest that you clear your browser cache.  Sometimes the download libraries use browser libraries and a bad version of a file will be in a browser cache.

 

HTH,

-Alex

 

From: Serkan Taş [hidden email]
Reply-To: [hidden email] [hidden email]
Date: Tuesday, December 11, 2018 at 11:05 AM
To: [hidden email] [hidden email]
Subject: compiler is broken

 

Hi,

When compiling royale I am getting error below. Any one has idea ?

Here is the end of the log :

get-from-cache-if-needed:
    [unzip] Expanding: D:\dev\royale-emulation-works\github\royale-asjs\in\apache-flex-flexunit-4.2.0-4.12.0-bin.zip into D:\dev\royale-emulation-works\github\royale-asjs\in\flexunit

BUILD FAILED
D:\dev\royale-emulation-works\github\royale-asjs\build.xml:193: The following error occurred while executing this line:
D:\dev\royale-emulation-works\github\royale-asjs\frameworks\build.xml:106: The following error occurred while executing this line:
D:\dev\royale-emulation-works\github\royale-asjs\frameworks\downloads.xml:110: Error while expanding D:\dev\royale-emulation-works\github\royale-asjs\in\apache-flex-flexunit-4.2.0-4.12.0-bin.zip
java.util.zip.ZipException: archive is not a ZIP archive
        at org.apache.tools.zip.ZipFile.positionAtEndOfCentralDirectoryRecord(ZipFile.java:775)
        at org.apache.tools.zip.ZipFile.positionAtCentralDirectory(ZipFile.java:711)
        at org.apache.tools.zip.ZipFile.populateFromCentralDirectory(ZipFile.java:456)
        at org.apache.tools.zip.ZipFile.<init>(ZipFile.java:216)
        at org.apache.tools.ant.taskdefs.Expand.expandFile(Expand.java:190)
        at org.apache.tools.ant.taskdefs.Expand.execute(Expand.java:157)
        at org.apache.tools.ant.UnknownElement.execute(UnknownElement.java:292)
        at sun.reflect.GeneratedMethodAccessor4.invoke(Unknown Source)
        at sun.reflect.DelegatingMethodAccessorImpl.invoke(DelegatingMethodAccessorImpl.java:43)
        at java.lang.reflect.Method.invoke(Method.java:498)
        at org.apache.tools.ant.dispatch.DispatchUtils.execute(DispatchUtils.java:99)
        at org.apache.tools.ant.Task.perform(Task.java:350)
        at org.apache.tools.ant.Target.execute(Target.java:449)
        at org.apache.tools.ant.Target.performTasks(Target.java:470)
        at org.apache.tools.ant.Project.executeSortedTargets(Project.java:1388)
        at org.apache.tools.ant.helper.SingleCheckExecutor.executeTargets(SingleCheckExecutor.java:36)
        at org.apache.tools.ant.Project.executeTargets(Project.java:1251)
        at org.apache.tools.ant.taskdefs.Ant.execute(Ant.java:437)
        at org.apache.tools.ant.UnknownElement.execute(UnknownElement.java:292)
        at sun.reflect.GeneratedMethodAccessor4.invoke(Unknown Source)
        at sun.reflect.DelegatingMethodAccessorImpl.invoke(DelegatingMethodAccessorImpl.java:43)
        at java.lang.reflect.Method.invoke(Method.java:498)
        at org.apache.tools.ant.dispatch.DispatchUtils.execute(DispatchUtils.java:99)
        at org.apache.tools.ant.Task.perform(Task.java:350)
        at org.apache.tools.ant.Target.execute(Target.java:449)
        at org.apache.tools.ant.Target.performTasks(Target.java:470)
        at org.apache.tools.ant.Project.executeSortedTargets(Project.java:1388)
        at org.apache.tools.ant.helper.SingleCheckExecutor.executeTargets(SingleCheckExecutor.java:36)
        at org.apache.tools.ant.Project.executeTargets(Project.java:1251)
        at org.apache.tools.ant.taskdefs.Ant.execute(Ant.java:437)
        at org.apache.tools.ant.UnknownElement.execute(UnknownElement.java:292)
        at sun.reflect.GeneratedMethodAccessor4.invoke(Unknown Source)
        at sun.reflect.DelegatingMethodAccessorImpl.invoke(DelegatingMethodAccessorImpl.java:43)
        at java.lang.reflect.Method.invoke(Method.java:498)
        at org.apache.tools.ant.dispatch.DispatchUtils.execute(DispatchUtils.java:99)
        at org.apache.tools.ant.Task.perform(Task.java:350)
        at org.apache.tools.ant.Target.execute(Target.java:449)
        at org.apache.tools.ant.Target.performTasks(Target.java:470)
        at org.apache.tools.ant.Project.executeSortedTargets(Project.java:1388)
        at org.apache.tools.ant.Project.executeTarget(Project.java:1361)
        at org.apache.tools.ant.helper.DefaultExecutor.executeTargets(DefaultExecutor.java:41)
        at org.apache.tools.ant.Project.executeTargets(Project.java:1251)
        at org.apache.tools.ant.Main.runBuild(Main.java:834)
        at org.apache.tools.ant.Main.startAnt(Main.java:223)
        at org.apache.tools.ant.launch.Launcher.run(Launcher.java:284)
        at org.apache.tools.ant.launch.Launcher.main(Launcher.java:101)

Total time: 3 minutes 44 seconds


Thanks,
Serkan




 


 

--

Piotr Zarzycki 

Patreon: https://www.patreon.com/piotrzarzycki






 

 










Reply | Threaded
Open this post in threaded view
|

Re: compiler is broken

Serkan Taş
I tried in all tree folders but royale-asjs fails with download error

batch file :

 .\royale-asjs-ant.bat
set PLAYERGLOBAL_HOME=D:/dev/royale-emulation-works/emulatedcomps
set FLEX_HOME=D:/dev/Adobe/flex_sdk_4.6
set GOOG_HOME=D:/dev/royale-emulation-works/closure-library-20180910
set JAVA_TOOL_OPTIONS=-Dfile.encoding=UTF-8 -Duser.country=EN -Duser.language=en
(cd ..\github\royale-asjs   && ant)


result :


download_using_get:

double-check-file:
     [echo] Need file: ${still_no_file}

get-from-cache-if-needed:
    [unzip] Expanding: D:\dev\royale-emulation-works\github\royale-asjs\in\apache-flex-flexunit-4.2.0-4.12.0-bin.zip into D:\dev\royale-emulation-works\github\royale-asjs\in\flexunit

BUILD FAILED
D:\dev\royale-emulation-works\github\royale-asjs\build.xml:193: The following error occurred while executing this line:
D:\dev\royale-emulation-works\github\royale-asjs\frameworks\build.xml:106: The following error occurred while executing this line:
D:\dev\royale-emulation-works\github\royale-asjs\frameworks\downloads.xml:110: Error while expanding D:\dev\royale-emulation-works\github\royale-asjs\in\apache-flex-flexunit-4.2.0-4.12.0-bin.zip
java.util.zip.ZipException: archive is not a ZIP archive
        at org.apache.tools.zip.ZipFile.positionAtEndOfCentralDirectoryRecord(ZipFile.java:775)
        at org.apache.tools.zip.ZipFile.positionAtCentralDirectory(ZipFile.java:711)
        at org.apache.tools.zip.ZipFile.populateFromCentralDirectory(ZipFile.java:456)
        at org.apache.tools.zip.ZipFile.<init>(ZipFile.java:216)
        at org.apache.tools.ant.taskdefs.Expand.expandFile(Expand.java:190)
        at org.apache.tools.ant.taskdefs.Expand.execute(Expand.java:157)
        at org.apache.tools.ant.UnknownElement.execute(UnknownElement.java:292)
        at sun.reflect.GeneratedMethodAccessor4.invoke(Unknown Source)
        at sun.reflect.DelegatingMethodAccessorImpl.invoke(DelegatingMethodAccessorImpl.java:43)
        at java.lang.reflect.Method.invoke(Method.java:498)
        at org.apache.tools.ant.dispatch.DispatchUtils.execute(DispatchUtils.java:99)
        at org.apache.tools.ant.Task.perform(Task.java:350)
        at org.apache.tools.ant.Target.execute(Target.java:449)
        at org.apache.tools.ant.Target.performTasks(Target.java:470)
        at org.apache.tools.ant.Project.executeSortedTargets(Project.java:1388)
        at org.apache.tools.ant.helper.SingleCheckExecutor.executeTargets(SingleCheckExecutor.java:36)
        at org.apache.tools.ant.Project.executeTargets(Project.java:1251)
        at org.apache.tools.ant.taskdefs.Ant.execute(Ant.java:437)
        at org.apache.tools.ant.UnknownElement.execute(UnknownElement.java:292)
        at sun.reflect.GeneratedMethodAccessor4.invoke(Unknown Source)
        at sun.reflect.DelegatingMethodAccessorImpl.invoke(DelegatingMethodAccessorImpl.java:43)
        at java.lang.reflect.Method.invoke(Method.java:498)
        at org.apache.tools.ant.dispatch.DispatchUtils.execute(DispatchUtils.java:99)
        at org.apache.tools.ant.Task.perform(Task.java:350)
        at org.apache.tools.ant.Target.execute(Target.java:449)
        at org.apache.tools.ant.Target.performTasks(Target.java:470)
        at org.apache.tools.ant.Project.executeSortedTargets(Project.java:1388)
        at org.apache.tools.ant.helper.SingleCheckExecutor.executeTargets(SingleCheckExecutor.java:36)
        at org.apache.tools.ant.Project.executeTargets(Project.java:1251)
        at org.apache.tools.ant.taskdefs.Ant.execute(Ant.java:437)
        at org.apache.tools.ant.UnknownElement.execute(UnknownElement.java:292)
        at sun.reflect.GeneratedMethodAccessor4.invoke(Unknown Source)
        at sun.reflect.DelegatingMethodAccessorImpl.invoke(DelegatingMethodAccessorImpl.java:43)
        at java.lang.reflect.Method.invoke(Method.java:498)
        at org.apache.tools.ant.dispatch.DispatchUtils.execute(DispatchUtils.java:99)
        at org.apache.tools.ant.Task.perform(Task.java:350)
        at org.apache.tools.ant.Target.execute(Target.java:449)
        at org.apache.tools.ant.Target.performTasks(Target.java:470)
        at org.apache.tools.ant.Project.executeSortedTargets(Project.java:1388)
        at org.apache.tools.ant.Project.executeTarget(Project.java:1361)
        at org.apache.tools.ant.helper.DefaultExecutor.executeTargets(DefaultExecutor.java:41)
        at org.apache.tools.ant.Project.executeTargets(Project.java:1251)
        at org.apache.tools.ant.Main.runBuild(Main.java:834)
        at org.apache.tools.ant.Main.startAnt(Main.java:223)
        at org.apache.tools.ant.launch.Launcher.run(Launcher.java:284)
        at org.apache.tools.ant.launch.Launcher.main(Launcher.java:101)

Total time: 1 second



Thanks,
Serkan

20.12.2018 01:52 tarihinde Alex Harui yazdı:

It seems like you have royale-asjs, royale-typedefs, and royale-compiler repos and are the batch file is trying to run Ant on it.  If you have that, you shouldn’t need everything in the batch file that comes before it, especially the Maven stuff.  Once you have the 3 repos, you should be able to run “ant” in any of them.

 

-Alex

 

From: Serkan Taş [hidden email]
Reply-To: [hidden email] [hidden email]
Date: Tuesday, December 18, 2018 at 11:15 AM
To: [hidden email] [hidden email]
Subject: Re: compiler is broken

 

Alex, I know your thoughts about custom build process, and trying to resolve it.

But it needs some time to understand and implement, I am working on.

Thanks,
Serkan

18.12.2018 22:11 tarihinde Alex Harui yazdı:

Serkan,

 

The build commands are in some batch file.  I cannot tell what is in it, but it appears to be calling the super-clean target which deletes the downloads.

 

Again, this is the risk and inefficiencies of using a custom build process.

 

-Alex

 

From: Serkan Taş [hidden email]
Reply-To: [hidden email] [hidden email]
Date: Tuesday, December 18, 2018 at 10:36 AM
To: [hidden email] [hidden email]
Subject: Re: compiler is broken

 

Hi Alex,

Here is the link of the log file including the build command : https://drive.google.com/open?id=1i_4_0m0oVb06_N2ymFpbv14Dcs71KNR9

Why I think mirror is broken ?

When I open the link :
http://www.apache.org/dyn/closer.lua/flex/flexunit/4.2.0/binaries/apache-flex-flexunit-4.2.0-4.12.0-bin.zip


I see the links for the file apache-flex-flexunit-4.2.0-4.12.0-bin.zip

When try to download with right-click-save-as for http://ftp.itu.edu.tr/Mirror/Apache/flex/flexunit/4.2.0/binaries/apache-flex-flexunit-4.2.0-4.12.0-bin.zip, I get file not downloaded.

When try to download with right-click-save-as for

ftp://ftp.itu.edu.tr/Mirror/Apache/flex/flexunit/4.2.0/binaries/apache-flex-flexunit-4.2.0-4.12.0-bin.zip
or
https://www-us.apache.org/dist/flex/flexunit/4.2.0/binaries/apache-flex-flexunit-4.2.0-4.12.0-bin.zip 
or
https://www-eu.apache.org/dist/flex/flexunit/4.2.0/binaries/apache-flex-flexunit-4.2.0-4.12.0-bin.zip

I get file downloaded completely.

But the compiler uses the first one.

Let me know it you need more information.

Thanks,
Serkan

18.12.2018 01:33 tarihinde Alex Harui yazdı:

Serkan,

 

What Ant targets are you running?  Post a link to the console output including the ant command.

 

I’m not sure why you say the mirror and file are broken.  What errors are you getting that indicate that it is broken?

 

-Alex

 

From: Serkan Taş [hidden email]
Reply-To: [hidden email] [hidden email]
Date: Monday, December 17, 2018 at 12:52 PM
To: [hidden email] [hidden email]
Subject: Re: compiler is broken

 

Hi,

When I downloaded the zip file from the link https://www-eu.apache.org/dist/flex/flexunit/4.2.0/binaries/apache-flex-flexunit-4.2.0-4.12.0-bin.zip
and put it into the folder royale-asjs/in, I expected the compiler should not delete, bud done so.

Two problems here:

1. The mirror and the file in apache is somehow broken :(e.g) http://www.apache.org/dyn/closer.lua/flex/flexunit/4.2.0/binaries/apache-flex-flexunit-4.2.0-4.12.0-bin.zip
2. File are deleted and downloaded each time during the build.

May give some idea.

It is not blocking me for now as I am using nightly builds unit I find a fix.

Thanks,
Serkan

16.12.2018 22:53 tarihinde Serkan Taş yazdı:

This time it is ok, I tired https://www-eu.apache.org/dist/flex/flexunit/4.2.0/binaries/apache-flex-flexunit-4.2.0-4.12.0-bin.zip

Thanks,
Serkan

16.12.2018 22:42 tarihinde Serkan Taş yazdı:

The link is not working Alex, just 16K is downloaded may be it is related with my environment.

Thanks,
Serkan

16.12.2018 10:04 tarihinde Alex Harui yazdı:

Hmm.  Maybe the cgi isn’t working.

 

Try: http://www.apache.org/dyn/closer.lua/flex/flexunit/4.2.0/binaries/apache-flex-flexunit-4.2.0-4.12.0-bin.zip

 

HTH,

-Alex

 

From: Serkan Taş [hidden email]
Reply-To: [hidden email] [hidden email]
Date: Saturday, December 15, 2018 at 3:13 AM
To: [hidden email] [hidden email]
Subject: Re: compiler is broken

 

I guess mirror is broken, is it possible to set not to use mirror ?

14.12.2018 09:39 tarihinde Piotr Zarzycki yazdı:

To me the other solution was as well downloading that file and setup one of the environment variable CACHE - It always being checked during compilation whether file exists there. If not we are trying to download it. 

 

Find that variable if anything won't work. 

 

Thanks, Piotr

 

czw., 13 gru 2018 o 23:17 Alex Harui <[hidden email]> napisał(a):

Usually, your default browser cache, but sometimes clearing the Internet Explorer cache (even if you don’t use Internet Explorer) can help.

 

Try downloading the file manually by clicking that link in a browser and run a checksum on the results and see you get something that can be unzipped.

 

HTH,

-Alex

 

From: Serkan Taş <[hidden email]>
Reply-To: "[hidden email]" <[hidden email]>
Date: Thursday, December 13, 2018 at 1:56 PM
To: "[hidden email]" <[hidden email]>
Subject: Re: compiler is broken

 

Hi Alex,

Which browser cache should be cleaned ?

Here is the download command from log :

download_using_mirror:
      [get] Getting: http://www.apache.org/dyn/mirrors/mirrors.cgi/flex/flexunit/4.2.0/binaries/apache-flex-flexunit-4.2.0-4.12.0-bin.zip?asjson=true
      [get] To: D:\dev\royale-emulation-works\github\royale-asjs\frameworks\mirror.json
      [get] .

check_mirror_json:

use_mirror:
   [delete] Deleting: D:\dev\royale-emulation-works\github\royale-asjs\frameworks\mirror.json
     [echo] Using mirror: http://ftp.itu.edu.tr/Mirror/Apache/
      [get] Getting: http://ftp.itu.edu.tr/Mirror/Apache/flex/flexunit/4.2.0/binaries/apache-flex-flexunit-4.2.0-4.12.0-bin.zip
      [get] To: D:\dev\royale-emulation-works\github\royale-asjs\in\apache-flex-flexunit-4.2.0-4.12.0-bin.zip




And full log for reference : https://drive.google.com/open?id=14rWYkD--Dv89nw8H1lJ1Dymg4IQVznKg

Thanks,
Serkan

11.12.2018 22:09 tarihinde Alex Harui yazdı:

Hi Serkan,

 

I don’t think that has anything to do with the compiler.  FlexUnit is for ActionScript unit tests.  I suggest that you clear your browser cache.  Sometimes the download libraries use browser libraries and a bad version of a file will be in a browser cache.

 

HTH,

-Alex

 

From: Serkan Taş [hidden email]
Reply-To: [hidden email] [hidden email]
Date: Tuesday, December 11, 2018 at 11:05 AM
To: [hidden email] [hidden email]
Subject: compiler is broken

 

Hi,

When compiling royale I am getting error below. Any one has idea ?

Here is the end of the log :

get-from-cache-if-needed:
    [unzip] Expanding: D:\dev\royale-emulation-works\github\royale-asjs\in\apache-flex-flexunit-4.2.0-4.12.0-bin.zip into D:\dev\royale-emulation-works\github\royale-asjs\in\flexunit

BUILD FAILED
D:\dev\royale-emulation-works\github\royale-asjs\build.xml:193: The following error occurred while executing this line:
D:\dev\royale-emulation-works\github\royale-asjs\frameworks\build.xml:106: The following error occurred while executing this line:
D:\dev\royale-emulation-works\github\royale-asjs\frameworks\downloads.xml:110: Error while expanding D:\dev\royale-emulation-works\github\royale-asjs\in\apache-flex-flexunit-4.2.0-4.12.0-bin.zip
java.util.zip.ZipException: archive is not a ZIP archive
        at org.apache.tools.zip.ZipFile.positionAtEndOfCentralDirectoryRecord(ZipFile.java:775)
        at org.apache.tools.zip.ZipFile.positionAtCentralDirectory(ZipFile.java:711)
        at org.apache.tools.zip.ZipFile.populateFromCentralDirectory(ZipFile.java:456)
        at org.apache.tools.zip.ZipFile.<init>(ZipFile.java:216)
        at org.apache.tools.ant.taskdefs.Expand.expandFile(Expand.java:190)
        at org.apache.tools.ant.taskdefs.Expand.execute(Expand.java:157)
        at org.apache.tools.ant.UnknownElement.execute(UnknownElement.java:292)
        at sun.reflect.GeneratedMethodAccessor4.invoke(Unknown Source)
        at sun.reflect.DelegatingMethodAccessorImpl.invoke(DelegatingMethodAccessorImpl.java:43)
        at java.lang.reflect.Method.invoke(Method.java:498)
        at org.apache.tools.ant.dispatch.DispatchUtils.execute(DispatchUtils.java:99)
        at org.apache.tools.ant.Task.perform(Task.java:350)
        at org.apache.tools.ant.Target.execute(Target.java:449)
        at org.apache.tools.ant.Target.performTasks(Target.java:470)
        at org.apache.tools.ant.Project.executeSortedTargets(Project.java:1388)
        at org.apache.tools.ant.helper.SingleCheckExecutor.executeTargets(SingleCheckExecutor.java:36)
        at org.apache.tools.ant.Project.executeTargets(Project.java:1251)
        at org.apache.tools.ant.taskdefs.Ant.execute(Ant.java:437)
        at org.apache.tools.ant.UnknownElement.execute(UnknownElement.java:292)
        at sun.reflect.GeneratedMethodAccessor4.invoke(Unknown Source)
        at sun.reflect.DelegatingMethodAccessorImpl.invoke(DelegatingMethodAccessorImpl.java:43)
        at java.lang.reflect.Method.invoke(Method.java:498)
        at org.apache.tools.ant.dispatch.DispatchUtils.execute(DispatchUtils.java:99)
        at org.apache.tools.ant.Task.perform(Task.java:350)
        at org.apache.tools.ant.Target.execute(Target.java:449)
        at org.apache.tools.ant.Target.performTasks(Target.java:470)
        at org.apache.tools.ant.Project.executeSortedTargets(Project.java:1388)
        at org.apache.tools.ant.helper.SingleCheckExecutor.executeTargets(SingleCheckExecutor.java:36)
        at org.apache.tools.ant.Project.executeTargets(Project.java:1251)
        at org.apache.tools.ant.taskdefs.Ant.execute(Ant.java:437)
        at org.apache.tools.ant.UnknownElement.execute(UnknownElement.java:292)
        at sun.reflect.GeneratedMethodAccessor4.invoke(Unknown Source)
        at sun.reflect.DelegatingMethodAccessorImpl.invoke(DelegatingMethodAccessorImpl.java:43)
        at java.lang.reflect.Method.invoke(Method.java:498)
        at org.apache.tools.ant.dispatch.DispatchUtils.execute(DispatchUtils.java:99)
        at org.apache.tools.ant.Task.perform(Task.java:350)
        at org.apache.tools.ant.Target.execute(Target.java:449)
        at org.apache.tools.ant.Target.performTasks(Target.java:470)
        at org.apache.tools.ant.Project.executeSortedTargets(Project.java:1388)
        at org.apache.tools.ant.Project.executeTarget(Project.java:1361)
        at org.apache.tools.ant.helper.DefaultExecutor.executeTargets(DefaultExecutor.java:41)
        at org.apache.tools.ant.Project.executeTargets(Project.java:1251)
        at org.apache.tools.ant.Main.runBuild(Main.java:834)
        at org.apache.tools.ant.Main.startAnt(Main.java:223)
        at org.apache.tools.ant.launch.Launcher.run(Launcher.java:284)
        at org.apache.tools.ant.launch.Launcher.main(Launcher.java:101)

Total time: 3 minutes 44 seconds


Thanks,
Serkan




 


 

--

Piotr Zarzycki 

Patreon: https://www.patreon.com/piotrzarzycki






 

 











Reply | Threaded
Open this post in threaded view
|

Re: compiler is broken

Alex Harui-2

Serkan,

 

It appears you are still using a batch file, and I cannot know what is in it, but earlier I explained that if you don’t run a super-clean or thirdparty-clean target and place a working flexunit zip file in the “in” folder, then the other ant targets should run without trying to download flexunit again.  That is how it works for the rest of us.

 

Look in the console output.  If you see thirdparty-clean running, then you are still calling the wrong ant targets.

 

-Alex

 

From: Serkan Taş <[hidden email]>
Reply-To: "[hidden email]" <[hidden email]>
Date: Thursday, December 20, 2018 at 12:48 PM
To: "[hidden email]" <[hidden email]>
Subject: Re: compiler is broken

 

I tried in all tree folders but royale-asjs fails with download error

batch file :

 .\royale-asjs-ant.bat
set PLAYERGLOBAL_HOME=D:/dev/royale-emulation-works/emulatedcomps
set FLEX_HOME=D:/dev/Adobe/flex_sdk_4.6
set GOOG_HOME=D:/dev/royale-emulation-works/closure-library-20180910
set JAVA_TOOL_OPTIONS=-Dfile.encoding=UTF-8 -Duser.country=EN -Duser.language=en
(cd ..\github\royale-asjs   && ant)


result :


download_using_get:

double-check-file:
     [echo] Need file: ${still_no_file}

get-from-cache-if-needed:
    [unzip] Expanding: D:\dev\royale-emulation-works\github\royale-asjs\in\apache-flex-flexunit-4.2.0-4.12.0-bin.zip into D:\dev\royale-emulation-works\github\royale-asjs\in\flexunit

BUILD FAILED
D:\dev\royale-emulation-works\github\royale-asjs\build.xml:193: The following error occurred while executing this line:
D:\dev\royale-emulation-works\github\royale-asjs\frameworks\build.xml:106: The following error occurred while executing this line:
D:\dev\royale-emulation-works\github\royale-asjs\frameworks\downloads.xml:110: Error while expanding D:\dev\royale-emulation-works\github\royale-asjs\in\apache-flex-flexunit-4.2.0-4.12.0-bin.zip
java.util.zip.ZipException: archive is not a ZIP archive
        at org.apache.tools.zip.ZipFile.positionAtEndOfCentralDirectoryRecord(ZipFile.java:775)
        at org.apache.tools.zip.ZipFile.positionAtCentralDirectory(ZipFile.java:711)
        at org.apache.tools.zip.ZipFile.populateFromCentralDirectory(ZipFile.java:456)
        at org.apache.tools.zip.ZipFile.<init>(ZipFile.java:216)
        at org.apache.tools.ant.taskdefs.Expand.expandFile(Expand.java:190)
        at org.apache.tools.ant.taskdefs.Expand.execute(Expand.java:157)
        at org.apache.tools.ant.UnknownElement.execute(UnknownElement.java:292)
        at sun.reflect.GeneratedMethodAccessor4.invoke(Unknown Source)
        at sun.reflect.DelegatingMethodAccessorImpl.invoke(DelegatingMethodAccessorImpl.java:43)
        at java.lang.reflect.Method.invoke(Method.java:498)
        at org.apache.tools.ant.dispatch.DispatchUtils.execute(DispatchUtils.java:99)
        at org.apache.tools.ant.Task.perform(Task.java:350)
        at org.apache.tools.ant.Target.execute(Target.java:449)
        at org.apache.tools.ant.Target.performTasks(Target.java:470)
        at org.apache.tools.ant.Project.executeSortedTargets(Project.java:1388)
        at org.apache.tools.ant.helper.SingleCheckExecutor.executeTargets(SingleCheckExecutor.java:36)
        at org.apache.tools.ant.Project.executeTargets(Project.java:1251)
        at org.apache.tools.ant.taskdefs.Ant.execute(Ant.java:437)
        at org.apache.tools.ant.UnknownElement.execute(UnknownElement.java:292)
        at sun.reflect.GeneratedMethodAccessor4.invoke(Unknown Source)
        at sun.reflect.DelegatingMethodAccessorImpl.invoke(DelegatingMethodAccessorImpl.java:43)
        at java.lang.reflect.Method.invoke(Method.java:498)
        at org.apache.tools.ant.dispatch.DispatchUtils.execute(DispatchUtils.java:99)
        at org.apache.tools.ant.Task.perform(Task.java:350)
        at org.apache.tools.ant.Target.execute(Target.java:449)
        at org.apache.tools.ant.Target.performTasks(Target.java:470)
        at org.apache.tools.ant.Project.executeSortedTargets(Project.java:1388)
        at org.apache.tools.ant.helper.SingleCheckExecutor.executeTargets(SingleCheckExecutor.java:36)
        at org.apache.tools.ant.Project.executeTargets(Project.java:1251)
        at org.apache.tools.ant.taskdefs.Ant.execute(Ant.java:437)
        at org.apache.tools.ant.UnknownElement.execute(UnknownElement.java:292)
        at sun.reflect.GeneratedMethodAccessor4.invoke(Unknown Source)
        at sun.reflect.DelegatingMethodAccessorImpl.invoke(DelegatingMethodAccessorImpl.java:43)
        at java.lang.reflect.Method.invoke(Method.java:498)
        at org.apache.tools.ant.dispatch.DispatchUtils.execute(DispatchUtils.java:99)
        at org.apache.tools.ant.Task.perform(Task.java:350)
        at org.apache.tools.ant.Target.execute(Target.java:449)
        at org.apache.tools.ant.Target.performTasks(Target.java:470)
        at org.apache.tools.ant.Project.executeSortedTargets(Project.java:1388)
        at org.apache.tools.ant.Project.executeTarget(Project.java:1361)
        at org.apache.tools.ant.helper.DefaultExecutor.executeTargets(DefaultExecutor.java:41)
        at org.apache.tools.ant.Project.executeTargets(Project.java:1251)
        at org.apache.tools.ant.Main.runBuild(Main.java:834)
        at org.apache.tools.ant.Main.startAnt(Main.java:223)
        at org.apache.tools.ant.launch.Launcher.run(Launcher.java:284)
        at org.apache.tools.ant.launch.Launcher.main(Launcher.java:101)

Total time: 1 second



Thanks,
Serkan

20.12.2018 01:52 tarihinde Alex Harui yazdı:

It seems like you have royale-asjs, royale-typedefs, and royale-compiler repos and are the batch file is trying to run Ant on it.  If you have that, you shouldn’t need everything in the batch file that comes before it, especially the Maven stuff.  Once you have the 3 repos, you should be able to run “ant” in any of them.

 

-Alex

 

From: Serkan Taş [hidden email]
Reply-To: [hidden email] [hidden email]
Date: Tuesday, December 18, 2018 at 11:15 AM
To: [hidden email] [hidden email]
Subject: Re: compiler is broken

 

Alex, I know your thoughts about custom build process, and trying to resolve it.

But it needs some time to understand and implement, I am working on.

Thanks,
Serkan

18.12.2018 22:11 tarihinde Alex Harui yazdı:

Serkan,

 

The build commands are in some batch file.  I cannot tell what is in it, but it appears to be calling the super-clean target which deletes the downloads.

 

Again, this is the risk and inefficiencies of using a custom build process.

 

-Alex

 

From: Serkan Taş [hidden email]
Reply-To: [hidden email] [hidden email]
Date: Tuesday, December 18, 2018 at 10:36 AM
To: [hidden email] [hidden email]
Subject: Re: compiler is broken

 

Hi Alex,

Here is the link of the log file including the build command : https://drive.google.com/open?id=1i_4_0m0oVb06_N2ymFpbv14Dcs71KNR9

Why I think mirror is broken ?

When I open the link :
http://www.apache.org/dyn/closer.lua/flex/flexunit/4.2.0/binaries/apache-flex-flexunit-4.2.0-4.12.0-bin.zip


I see the links for the file apache-flex-flexunit-4.2.0-4.12.0-bin.zip

When try to download with right-click-save-as for http://ftp.itu.edu.tr/Mirror/Apache/flex/flexunit/4.2.0/binaries/apache-flex-flexunit-4.2.0-4.12.0-bin.zip, I get file not downloaded.

When try to download with right-click-save-as for

ftp://ftp.itu.edu.tr/Mirror/Apache/flex/flexunit/4.2.0/binaries/apache-flex-flexunit-4.2.0-4.12.0-bin.zip
or
https://www-us.apache.org/dist/flex/flexunit/4.2.0/binaries/apache-flex-flexunit-4.2.0-4.12.0-bin.zip 
or
https://www-eu.apache.org/dist/flex/flexunit/4.2.0/binaries/apache-flex-flexunit-4.2.0-4.12.0-bin.zip

I get file downloaded completely.

But the compiler uses the first one.

Let me know it you need more information.

Thanks,
Serkan

18.12.2018 01:33 tarihinde Alex Harui yazdı:

Serkan,

 

What Ant targets are you running?  Post a link to the console output including the ant command.

 

I’m not sure why you say the mirror and file are broken.  What errors are you getting that indicate that it is broken?

 

-Alex

 

From: Serkan Taş [hidden email]
Reply-To: [hidden email] [hidden email]
Date: Monday, December 17, 2018 at 12:52 PM
To: [hidden email] [hidden email]
Subject: Re: compiler is broken

 

Hi,

When I downloaded the zip file from the link https://www-eu.apache.org/dist/flex/flexunit/4.2.0/binaries/apache-flex-flexunit-4.2.0-4.12.0-bin.zip
and put it into the folder royale-asjs/in, I expected the compiler should not delete, bud done so.

Two problems here:

1. The mirror and the file in apache is somehow broken :(e.g) http://www.apache.org/dyn/closer.lua/flex/flexunit/4.2.0/binaries/apache-flex-flexunit-4.2.0-4.12.0-bin.zip
2. File are deleted and downloaded each time during the build.

May give some idea.

It is not blocking me for now as I am using nightly builds unit I find a fix.

Thanks,
Serkan

16.12.2018 22:53 tarihinde Serkan Taş yazdı:

This time it is ok, I tired https://www-eu.apache.org/dist/flex/flexunit/4.2.0/binaries/apache-flex-flexunit-4.2.0-4.12.0-bin.zip

Thanks,
Serkan

16.12.2018 22:42 tarihinde Serkan Taş yazdı:

The link is not working Alex, just 16K is downloaded may be it is related with my environment.

Thanks,
Serkan

16.12.2018 10:04 tarihinde Alex Harui yazdı:

Hmm.  Maybe the cgi isn’t working.

 

Try: http://www.apache.org/dyn/closer.lua/flex/flexunit/4.2.0/binaries/apache-flex-flexunit-4.2.0-4.12.0-bin.zip

 

HTH,

-Alex

 

From: Serkan Taş [hidden email]
Reply-To: [hidden email] [hidden email]
Date: Saturday, December 15, 2018 at 3:13 AM
To: [hidden email] [hidden email]
Subject: Re: compiler is broken

 

I guess mirror is broken, is it possible to set not to use mirror ?

14.12.2018 09:39 tarihinde Piotr Zarzycki yazdı:

To me the other solution was as well downloading that file and setup one of the environment variable CACHE - It always being checked during compilation whether file exists there. If not we are trying to download it. 

 

Find that variable if anything won't work. 

 

Thanks, Piotr

 

czw., 13 gru 2018 o 23:17 Alex Harui <[hidden email]> napisał(a):

Usually, your default browser cache, but sometimes clearing the Internet Explorer cache (even if you don’t use Internet Explorer) can help.

 

Try downloading the file manually by clicking that link in a browser and run a checksum on the results and see you get something that can be unzipped.

 

HTH,

-Alex

 

From: Serkan Taş <[hidden email]>
Reply-To: "[hidden email]" <[hidden email]>
Date: Thursday, December 13, 2018 at 1:56 PM
To: "[hidden email]" <[hidden email]>
Subject: Re: compiler is broken

 

Hi Alex,

Which browser cache should be cleaned ?

Here is the download command from log :

download_using_mirror:
      [get] Getting: http://www.apache.org/dyn/mirrors/mirrors.cgi/flex/flexunit/4.2.0/binaries/apache-flex-flexunit-4.2.0-4.12.0-bin.zip?asjson=true
      [get] To: D:\dev\royale-emulation-works\github\royale-asjs\frameworks\mirror.json
      [get] .

check_mirror_json:

use_mirror:
   [delete] Deleting: D:\dev\royale-emulation-works\github\royale-asjs\frameworks\mirror.json
     [echo] Using mirror: http://ftp.itu.edu.tr/Mirror/Apache/
      [get] Getting: http://ftp.itu.edu.tr/Mirror/Apache/flex/flexunit/4.2.0/binaries/apache-flex-flexunit-4.2.0-4.12.0-bin.zip
      [get] To: D:\dev\royale-emulation-works\github\royale-asjs\in\apache-flex-flexunit-4.2.0-4.12.0-bin.zip




And full log for reference : https://drive.google.com/open?id=14rWYkD--Dv89nw8H1lJ1Dymg4IQVznKg

Thanks,
Serkan

11.12.2018 22:09 tarihinde Alex Harui yazdı:

Hi Serkan,

 

I don’t think that has anything to do with the compiler.  FlexUnit is for ActionScript unit tests.  I suggest that you clear your browser cache.  Sometimes the download libraries use browser libraries and a bad version of a file will be in a browser cache.

 

HTH,

-Alex

 

From: Serkan Taş [hidden email]
Reply-To: [hidden email] [hidden email]
Date: Tuesday, December 11, 2018 at 11:05 AM
To: [hidden email] [hidden email]
Subject: compiler is broken

 

Hi,

When compiling royale I am getting error below. Any one has idea ?

Here is the end of the log :

get-from-cache-if-needed:
    [unzip] Expanding: D:\dev\royale-emulation-works\github\royale-asjs\in\apache-flex-flexunit-4.2.0-4.12.0-bin.zip into D:\dev\royale-emulation-works\github\royale-asjs\in\flexunit

BUILD FAILED
D:\dev\royale-emulation-works\github\royale-asjs\build.xml:193: The following error occurred while executing this line:
D:\dev\royale-emulation-works\github\royale-asjs\frameworks\build.xml:106: The following error occurred while executing this line:
D:\dev\royale-emulation-works\github\royale-asjs\frameworks\downloads.xml:110: Error while expanding D:\dev\royale-emulation-works\github\royale-asjs\in\apache-flex-flexunit-4.2.0-4.12.0-bin.zip
java.util.zip.ZipException: archive is not a ZIP archive
        at org.apache.tools.zip.ZipFile.positionAtEndOfCentralDirectoryRecord(ZipFile.java:775)
        at org.apache.tools.zip.ZipFile.positionAtCentralDirectory(ZipFile.java:711)
        at org.apache.tools.zip.ZipFile.populateFromCentralDirectory(ZipFile.java:456)
        at org.apache.tools.zip.ZipFile.<init>(ZipFile.java:216)
        at org.apache.tools.ant.taskdefs.Expand.expandFile(Expand.java:190)
        at org.apache.tools.ant.taskdefs.Expand.execute(Expand.java:157)
        at org.apache.tools.ant.UnknownElement.execute(UnknownElement.java:292)
        at sun.reflect.GeneratedMethodAccessor4.invoke(Unknown Source)
        at sun.reflect.DelegatingMethodAccessorImpl.invoke(DelegatingMethodAccessorImpl.java:43)
        at java.lang.reflect.Method.invoke(Method.java:498)
        at org.apache.tools.ant.dispatch.DispatchUtils.execute(DispatchUtils.java:99)
        at org.apache.tools.ant.Task.perform(Task.java:350)
        at org.apache.tools.ant.Target.execute(Target.java:449)
        at org.apache.tools.ant.Target.performTasks(Target.java:470)
        at org.apache.tools.ant.Project.executeSortedTargets(Project.java:1388)
        at org.apache.tools.ant.helper.SingleCheckExecutor.executeTargets(SingleCheckExecutor.java:36)
        at org.apache.tools.ant.Project.executeTargets(Project.java:1251)
        at org.apache.tools.ant.taskdefs.Ant.execute(Ant.java:437)
        at org.apache.tools.ant.UnknownElement.execute(UnknownElement.java:292)
        at sun.reflect.GeneratedMethodAccessor4.invoke(Unknown Source)
        at sun.reflect.DelegatingMethodAccessorImpl.invoke(DelegatingMethodAccessorImpl.java:43)
        at java.lang.reflect.Method.invoke(Method.java:498)
        at org.apache.tools.ant.dispatch.DispatchUtils.execute(DispatchUtils.java:99)
        at org.apache.tools.ant.Task.perform(Task.java:350)
        at org.apache.tools.ant.Target.execute(Target.java:449)
        at org.apache.tools.ant.Target.performTasks(Target.java:470)
        at org.apache.tools.ant.Project.executeSortedTargets(Project.java:1388)
        at org.apache.tools.ant.helper.SingleCheckExecutor.executeTargets(SingleCheckExecutor.java:36)
        at org.apache.tools.ant.Project.executeTargets(Project.java:1251)
        at org.apache.tools.ant.taskdefs.Ant.execute(Ant.java:437)
        at org.apache.tools.ant.UnknownElement.execute(UnknownElement.java:292)
        at sun.reflect.GeneratedMethodAccessor4.invoke(Unknown Source)
        at sun.reflect.DelegatingMethodAccessorImpl.invoke(DelegatingMethodAccessorImpl.java:43)
        at java.lang.reflect.Method.invoke(Method.java:498)
        at org.apache.tools.ant.dispatch.DispatchUtils.execute(DispatchUtils.java:99)
        at org.apache.tools.ant.Task.perform(Task.java:350)
        at org.apache.tools.ant.Target.execute(Target.java:449)
        at org.apache.tools.ant.Target.performTasks(Target.java:470)
        at org.apache.tools.ant.Project.executeSortedTargets(Project.java:1388)
        at org.apache.tools.ant.Project.executeTarget(Project.java:1361)
        at org.apache.tools.ant.helper.DefaultExecutor.executeTargets(DefaultExecutor.java:41)
        at org.apache.tools.ant.Project.executeTargets(Project.java:1251)
        at org.apache.tools.ant.Main.runBuild(Main.java:834)
        at org.apache.tools.ant.Main.startAnt(Main.java:223)
        at org.apache.tools.ant.launch.Launcher.run(Launcher.java:284)
        at org.apache.tools.ant.launch.Launcher.main(Launcher.java:101)

Total time: 3 minutes 44 seconds


Thanks,
Serkan





 


 

--

Piotr Zarzycki 

Patreon: https://www.patreon.com/piotrzarzycki







 

 















Reply | Threaded
Open this post in threaded view
|

Re: compiler is broken

Serkan Taş

Hi Alex,

I gave you the name and all content of the batch file, nothing more  
and I use ant without target, do you want me to look in to build.xml  
and choose a target ?

name of file : .\royale-asjs-ant.bat

All the the things inside :

*********************************************************************************
set PLAYERGLOBAL_HOME=D:/dev/royale-emulation-works/emulatedcomps
set FLEX_HOME=D:/dev/Adobe/flex_sdk_4.6
set GOOG_HOME=D:/dev/royale-emulation-works/closure-library-20180910
set JAVA_TOOL_OPTIONS=-Dfile.encoding=UTF-8 -Duser.country=EN  
-Duser.language=en
(cd ..\github\royale-asjs && ant)
*********************************************************************************

I use batch to set env vars like JAVA_TOOL. No other third party  
cleaning or maven.

If you have any more questions, let me know.

Thanks,
Serkan


Alinti Alex Harui <[hidden email]>

> Serkan,
>
> It appears you are still using a batch file, and I cannot know what  
> is in it, but earlier I explained that if you don’t run a  
> super-clean or thirdparty-clean target and place a working flexunit  
> zip file in the “in” folder, then the other ant targets should run  
> without trying to download flexunit again.  That is how it works for  
> the rest of us.
>
> Look in the console output.  If you see thirdparty-clean running,  
> then you are still calling the wrong ant targets.
>
> -Alex
>
> From: Serkan Taş <[hidden email]>
> Reply-To: "[hidden email]" <[hidden email]>
> Date: Thursday, December 20, 2018 at 12:48 PM
> To: "[hidden email]" <[hidden email]>
> Subject: Re: compiler is broken
>
> I tried in all tree folders but royale-asjs fails with download error
>
> batch file :
>
>  .\royale-asjs-ant.bat
> set PLAYERGLOBAL_HOME=D:/dev/royale-emulation-works/emulatedcomps
> set FLEX_HOME=D:/dev/Adobe/flex_sdk_4.6
> set GOOG_HOME=D:/dev/royale-emulation-works/closure-library-20180910
> set JAVA_TOOL_OPTIONS=-Dfile.encoding=UTF-8 -Duser.country=EN  
> -Duser.language=en
> (cd ..\github\royale-asjs   && ant)
>
> result :
>
>
> download_using_get:
>
> double-check-file:
>      [echo] Need file: ${still_no_file}
>
> get-from-cache-if-needed:
>     [unzip] Expanding:  
> D:\dev\royale-emulation-works\github\royale-asjs\in\apache-flex-flexunit-4.2.0-4.12.0-bin.zip into  
> D:\dev\royale-emulation-works\github\royale-asjs\in\flexunit
>
> BUILD FAILED
> D:\dev\royale-emulation-works\github\royale-asjs\build.xml:193: The  
> following error occurred while executing this line:
> D:\dev\royale-emulation-works\github\royale-asjs\frameworks\build.xml:106:  
> The following error occurred while executing this line:
> D:\dev\royale-emulation-works\github\royale-asjs\frameworks\downloads.xml:110: Error while expanding  
> D:\dev\royale-emulation-works\github\royale-asjs\in\apache-flex-flexunit-4.2.0-4.12.0-bin.zip
> java.util.zip.ZipException: archive is not a ZIP archive
>         at  
> org.apache.tools.zip.ZipFile.positionAtEndOfCentralDirectoryRecord(ZipFile.java:775)
>         at  
> org.apache.tools.zip.ZipFile.positionAtCentralDirectory(ZipFile.java:711)
>         at  
> org.apache.tools.zip.ZipFile.populateFromCentralDirectory(ZipFile.java:456)
>         at org.apache.tools.zip.ZipFile.<init>(ZipFile.java:216)
>         at org.apache.tools.ant.taskdefs.Expand.expandFile(Expand.java:190)
>         at org.apache.tools.ant.taskdefs.Expand.execute(Expand.java:157)
>         at  
> org.apache.tools.ant.UnknownElement.execute(UnknownElement.java:292)
>         at sun.reflect.GeneratedMethodAccessor4.invoke(Unknown Source)
>         at  
> sun.reflect.DelegatingMethodAccessorImpl.invoke(DelegatingMethodAccessorImpl.java:43)
>         at java.lang.reflect.Method.invoke(Method.java:498)
>         at  
> org.apache.tools.ant.dispatch.DispatchUtils.execute(DispatchUtils.java:99)
>         at org.apache.tools.ant.Task.perform(Task.java:350)
>         at org.apache.tools.ant.Target.execute(Target.java:449)
>         at org.apache.tools.ant.Target.performTasks(Target.java:470)
>         at  
> org.apache.tools.ant.Project.executeSortedTargets(Project.java:1388)
>         at  
> org.apache.tools.ant.helper.SingleCheckExecutor.executeTargets(SingleCheckExecutor.java:36)
>         at org.apache.tools.ant.Project.executeTargets(Project.java:1251)
>         at org.apache.tools.ant.taskdefs.Ant.execute(Ant.java:437)
>         at  
> org.apache.tools.ant.UnknownElement.execute(UnknownElement.java:292)
>         at sun.reflect.GeneratedMethodAccessor4.invoke(Unknown Source)
>         at  
> sun.reflect.DelegatingMethodAccessorImpl.invoke(DelegatingMethodAccessorImpl.java:43)
>         at java.lang.reflect.Method.invoke(Method.java:498)
>         at  
> org.apache.tools.ant.dispatch.DispatchUtils.execute(DispatchUtils.java:99)
>         at org.apache.tools.ant.Task.perform(Task.java:350)
>         at org.apache.tools.ant.Target.execute(Target.java:449)
>         at org.apache.tools.ant.Target.performTasks(Target.java:470)
>         at  
> org.apache.tools.ant.Project.executeSortedTargets(Project.java:1388)
>         at  
> org.apache.tools.ant.helper.SingleCheckExecutor.executeTargets(SingleCheckExecutor.java:36)
>         at org.apache.tools.ant.Project.executeTargets(Project.java:1251)
>         at org.apache.tools.ant.taskdefs.Ant.execute(Ant.java:437)
>         at  
> org.apache.tools.ant.UnknownElement.execute(UnknownElement.java:292)
>         at sun.reflect.GeneratedMethodAccessor4.invoke(Unknown Source)
>         at  
> sun.reflect.DelegatingMethodAccessorImpl.invoke(DelegatingMethodAccessorImpl.java:43)
>         at java.lang.reflect.Method.invoke(Method.java:498)
>         at  
> org.apache.tools.ant.dispatch.DispatchUtils.execute(DispatchUtils.java:99)
>         at org.apache.tools.ant.Task.perform(Task.java:350)
>         at org.apache.tools.ant.Target.execute(Target.java:449)
>         at org.apache.tools.ant.Target.performTasks(Target.java:470)
>         at  
> org.apache.tools.ant.Project.executeSortedTargets(Project.java:1388)
>         at org.apache.tools.ant.Project.executeTarget(Project.java:1361)
>         at  
> org.apache.tools.ant.helper.DefaultExecutor.executeTargets(DefaultExecutor.java:41)
>         at org.apache.tools.ant.Project.executeTargets(Project.java:1251)
>         at org.apache.tools.ant.Main.runBuild(Main.java:834)
>         at org.apache.tools.ant.Main.startAnt(Main.java:223)
>         at org.apache.tools.ant.launch.Launcher.run(Launcher.java:284)
>         at org.apache.tools.ant.launch.Launcher.main(Launcher.java:101)
>
> Total time: 1 second
>
>
> Thanks,
> Serkan
> 20.12.2018 01:52 tarihinde Alex Harui yazdı:
> It seems like you have royale-asjs, royale-typedefs, and  
> royale-compiler repos and are the batch file is trying to run Ant on  
> it.  If you have that, you shouldn’t need everything in the batch  
> file that comes before it, especially the Maven stuff.  Once you  
> have the 3 repos, you should be able to run “ant” in any of them.
>
> -Alex
>
> From: Serkan Taş  
> <[hidden email]><mailto:[hidden email]>
> Reply-To: "[hidden email]"<mailto:[hidden email]>  
> <[hidden email]><mailto:[hidden email]>
> Date: Tuesday, December 18, 2018 at 11:15 AM
> To: "[hidden email]"<mailto:[hidden email]>  
> <[hidden email]><mailto:[hidden email]>
> Subject: Re: compiler is broken
>
> Alex, I know your thoughts about custom build process, and trying to  
> resolve it.
>
> But it needs some time to understand and implement, I am working on.
>
> Thanks,
> Serkan
> 18.12.2018 22:11 tarihinde Alex Harui yazdı:
> Serkan,
>
> The build commands are in some batch file.  I cannot tell what is in  
> it, but it appears to be calling the super-clean target which  
> deletes the downloads.
>
> Again, this is the risk and inefficiencies of using a custom build process.
>
> -Alex
>
> From: Serkan Taş  
> <[hidden email]><mailto:[hidden email]>
> Reply-To: "[hidden email]"<mailto:[hidden email]>  
> <[hidden email]><mailto:[hidden email]>
> Date: Tuesday, December 18, 2018 at 10:36 AM
> To: "[hidden email]"<mailto:[hidden email]>  
> <[hidden email]><mailto:[hidden email]>
> Subject: Re: compiler is broken
>
> Hi Alex,
>
> Here is the link of the log file including the build command :  
> https://drive.google.com/open?id=1i_4_0m0oVb06_N2ymFpbv14Dcs71KNR9<https://na01.safelinks.protection.outlook.com/?url=https%3A%2F%2Fdrive.google.com%2Fopen%3Fid%3D1i_4_0m0oVb06_N2ymFpbv14Dcs71KNR9&data=02%7C01%7Caharui%40adobe.com%7Cc97a76315634490149ea08d666bc8acd%7Cfa7b1b5a7b34438794aed2c178decee1%7C0%7C0%7C636809357303689895&sdata=16xbc03ps9hdlM2d3h8EC9jdS2kSFdIQb6J7NWRp8zA%3D&reserved=0>
>
> Why I think mirror is broken ?
>
> When I open the link :
> http://www.apache.org/dyn/closer.lua/flex/flexunit/4.2.0/binaries/apache-flex-flexunit-4.2.0-4.12.0-bin.zip<https://na01.safelinks.protection.outlook.com/?url=http%3A%2F%2Fwww.apache.org%2Fdyn%2Fcloser.lua%2Fflex%2Fflexunit%2F4.2.0%2Fbinaries%2Fapache-flex-flexunit-4.2.0-4.12.0-bin.zip&data=02%7C01%7Caharui%40adobe.com%7Cc97a76315634490149ea08d666bc8acd%7Cfa7b1b5a7b34438794aed2c178decee1%7C0%7C0%7C636809357303689895&sdata=QTmJFD6bejOtT9hzFIQ4IU3XABeTnvW3VJ4tevsTPyk%3D&reserved=0>
>
>
> I see the links for the file  
> apache-flex-flexunit-4.2.0-4.12.0-bin.zip<https://na01.safelinks.protection.outlook.com/?url=http%3A%2F%2Fftp.itu.edu.tr%2FMirror%2FApache%2Fflex%2Fflexunit%2F4.2.0%2Fbinaries%2Fapache-flex-flexunit-4.2.0-4.12.0-bin.zip&data=02%7C01%7Caharui%40adobe.com%7Cc97a76315634490149ea08d666bc8acd%7Cfa7b1b5a7b34438794aed2c178decee1%7C0%7C0%7C636809357303689895&sdata=NAUeAoqK47%2BodW0qlUAP2EktQN4ouEMAibvsdqeVfUY%3D&reserved=0>
>
> When try to download with right-click-save-as for  
> http://ftp.itu.edu.tr/Mirror/Apache/flex/flexunit/4.2.0/binaries/apache-flex-flexunit-4.2.0-4.12.0-bin.zip<https://na01.safelinks.protection.outlook.com/?url=http%3A%2F%2Fftp.itu.edu.tr%2FMirror%2FApache%2Fflex%2Fflexunit%2F4.2.0%2Fbinaries%2Fapache-flex-flexunit-4.2.0-4.12.0-bin.zip&data=02%7C01%7Caharui%40adobe.com%7Cc97a76315634490149ea08d666bc8acd%7Cfa7b1b5a7b34438794aed2c178decee1%7C0%7C0%7C636809357303689895&sdata=NAUeAoqK47%2BodW0qlUAP2EktQN4ouEMAibvsdqeVfUY%3D&reserved=0>, I get file not  
> downloaded.
>
> When try to download with right-click-save-as for
> <https://na01.safelinks.protection.outlook.com/?url=http%3A%2F%2Fftp.itu.edu.tr%2FMirror%2FApache%2Fflex%2Fflexunit%2F4.2.0%2Fbinaries%2Fapache-flex-flexunit-4.2.0-4.12.0-bin.zip&data=02%7C01%7Caharui%40adobe.com%7Cc97a76315634490149ea08d666bc8acd%7Cfa7b1b5a7b34438794aed2c178decee1%7C0%7C0%7C636809357303689895&sdata=NAUeAoqK47%2BodW0qlUAP2EktQN4ouEMAibvsdqeVfUY%3D&reserved=0>
> ftp://ftp.itu.edu.tr/Mirror/Apache/flex/flexunit/4.2.0/binaries/apache-flex-flexunit-4.2.0-4.12.0-bin.zip
> or
> https://www-us.apache.org/dist/flex/flexunit/4.2.0/binaries/apache-flex-flexunit-4.2.0-4.12.0-bin.zip<https://na01.safelinks.protection.outlook.com/?url=https%3A%2F%2Fwww-us.apache.org%2Fdist%2Fflex%2Fflexunit%2F4.2.0%2Fbinaries%2Fapache-flex-flexunit-4.2.0-4.12.0-bin.zip&data=02%7C01%7Caharui%40adobe.com%7Cc97a76315634490149ea08d666bc8acd%7Cfa7b1b5a7b34438794aed2c178decee1%7C0%7C0%7C636809357303689895&sdata=h7oF3xcGsnj3UWx2ujNncwH%2Fejldaj3qleuiyEzBwio%3D&reserved=0>
> or  
> <https://na01.safelinks.protection.outlook.com/?url=http%3A%2F%2Fftp.itu.edu.tr%2FMirror%2FApache%2Fflex%2Fflexunit%2F4.2.0%2Fbinaries%2Fapache-flex-flexunit-4.2.0-4.12.0-bin.zip&data=02%7C01%7Caharui%40adobe.com%7Cc97a76315634490149ea08d666bc8acd%7Cfa7b1b5a7b34438794aed2c178decee1%7C0%7C0%7C636809357303689895&sdata=NAUeAoqK47%2BodW0qlUAP2EktQN4ouEMAibvsdqeVfUY%3D&reserved=0>
> <https://na01.safelinks.protection.outlook.com/?url=http%3A%2F%2Fftp.itu.edu.tr%2FMirror%2FApache%2Fflex%2Fflexunit%2F4.2.0%2Fbinaries%2Fapache-flex-flexunit-4.2.0-4.12.0-bin.zip&data=02%7C01%7Caharui%40adobe.com%7Cc97a76315634490149ea08d666bc8acd%7Cfa7b1b5a7b34438794aed2c178decee1%7C0%7C0%7C636809357303689895&sdata=NAUeAoqK47%2BodW0qlUAP2EktQN4ouEMAibvsdqeVfUY%3D&reserved=0>https://www-eu.apache.org/dist/flex/flexunit/4.2.0/binaries/apache-flex-flexunit-4.2.0-4.12.0-bin.zip<https://na01.safelinks.protection.outlook.com/?url=https%3A%2F%2Fwww-eu.apache.org%2Fdist%2Fflex%2Fflexunit%2F4.2.0%2Fbinaries%2Fapache-flex-flexunit-4.2.0-4.12.0-bin.zip&data=02%7C01%7Caharui%40adobe.com%7Cc97a76315634490149ea08d666bc8acd%7Cfa7b1b5a7b34438794aed2c178decee1%7C0%7C0%7C636809357303689895&sdata=k3n8TUIM5S3EzVUXVCYPda9spuS5YswpW7uO7LT1q4E%3D&reserved=0>
>
> I get file downloaded completely.
>
> But the compiler uses the first one.
>
> Let me know it you need more information.
>
> Thanks,
> Serkan
> 18.12.2018 01:33 tarihinde Alex Harui yazdı:
> Serkan,
>
> What Ant targets are you running?  Post a link to the console output  
> including the ant command.
>
> I’m not sure why you say the mirror and file are broken.  What  
> errors are you getting that indicate that it is broken?
>
> -Alex
>
> From: Serkan Taş  
> <[hidden email]><mailto:[hidden email]>
> Reply-To: "[hidden email]"<mailto:[hidden email]>  
> <[hidden email]><mailto:[hidden email]>
> Date: Monday, December 17, 2018 at 12:52 PM
> To: "[hidden email]"<mailto:[hidden email]>  
> <[hidden email]><mailto:[hidden email]>
> Subject: Re: compiler is broken
>
> Hi,
>
> When I downloaded the zip file from the link  
> https://www-eu.apache.org/dist/flex/flexunit/4.2.0/binaries/apache-flex-flexunit-4.2.0-4.12.0-bin.zip<https://na01.safelinks.protection.outlook.com/?url=https%3A%2F%2Fwww-eu.apache.org%2Fdist%2Fflex%2Fflexunit%2F4.2.0%2Fbinaries%2Fapache-flex-flexunit-4.2.0-4.12.0-bin.zip&data=02%7C01%7Caharui%40adobe.com%7Cc97a76315634490149ea08d666bc8acd%7Cfa7b1b5a7b34438794aed2c178decee1%7C0%7C0%7C636809357303689895&sdata=k3n8TUIM5S3EzVUXVCYPda9spuS5YswpW7uO7LT1q4E%3D&reserved=0>
> and put it into the folder royale-asjs/in, I expected the compiler  
> should not delete, bud done so.
> Two problems here:
>
> 1. The mirror and the file in apache is somehow broken :(e.g)  
> http://www.apache.org/dyn/closer.lua/flex/flexunit/4.2.0/binaries/apache-flex-flexunit-4.2.0-4.12.0-bin.zip<https://na01.safelinks.protection.outlook.com/?url=http%3A%2F%2Fwww.apache.org%2Fdyn%2Fcloser.lua%2Fflex%2Fflexunit%2F4.2.0%2Fbinaries%2Fapache-flex-flexunit-4.2.0-4.12.0-bin.zip&data=02%7C01%7Caharui%40adobe.com%7Cc97a76315634490149ea08d666bc8acd%7Cfa7b1b5a7b34438794aed2c178decee1%7C0%7C0%7C636809357303689895&sdata=QTmJFD6bejOtT9hzFIQ4IU3XABeTnvW3VJ4tevsTPyk%3D&reserved=0>
> 2. File are deleted and downloaded each time during the build.
>
> May give some idea.
>
> It is not blocking me for now as I am using nightly builds unit I find a fix.
>
> Thanks,
> Serkan
>
> 16.12.2018 22:53 tarihinde Serkan Taş yazdı:
> This time it is ok, I tired  
> https://www-eu.apache.org/dist/flex/flexunit/4.2.0/binaries/apache-flex-flexunit-4.2.0-4.12.0-bin.zip<https://na01.safelinks.protection.outlook.com/?url=https%3A%2F%2Fwww-eu.apache.org%2Fdist%2Fflex%2Fflexunit%2F4.2.0%2Fbinaries%2Fapache-flex-flexunit-4.2.0-4.12.0-bin.zip&data=02%7C01%7Caharui%40adobe.com%7Cc97a76315634490149ea08d666bc8acd%7Cfa7b1b5a7b34438794aed2c178decee1%7C0%7C0%7C636809357303689895&sdata=k3n8TUIM5S3EzVUXVCYPda9spuS5YswpW7uO7LT1q4E%3D&reserved=0>
>
> Thanks,
> Serkan
> 16.12.2018 22:42 tarihinde Serkan Taş yazdı:
> The link is not working Alex, just 16K is downloaded may be it is  
> related with my environment.
>
> Thanks,
> Serkan
> 16.12.2018 10:04 tarihinde Alex Harui yazdı:
> Hmm.  Maybe the cgi isn’t working.
>
> Try:  
> http://www.apache.org/dyn/closer.lua/flex/flexunit/4.2.0/binaries/apache-flex-flexunit-4.2.0-4.12.0-bin.zip<https://na01.safelinks.protection.outlook.com/?url=http%3A%2F%2Fwww.apache.org%2Fdyn%2Fcloser.lua%2Fflex%2Fflexunit%2F4.2.0%2Fbinaries%2Fapache-flex-flexunit-4.2.0-4.12.0-bin.zip&data=02%7C01%7Caharui%40adobe.com%7Cc97a76315634490149ea08d666bc8acd%7Cfa7b1b5a7b34438794aed2c178decee1%7C0%7C0%7C636809357303689895&sdata=QTmJFD6bejOtT9hzFIQ4IU3XABeTnvW3VJ4tevsTPyk%3D&reserved=0>
>
> HTH,
> -Alex
>
> From: Serkan Taş  
> <[hidden email]><mailto:[hidden email]>
> Reply-To: "[hidden email]"<mailto:[hidden email]>  
> <[hidden email]><mailto:[hidden email]>
> Date: Saturday, December 15, 2018 at 3:13 AM
> To: "[hidden email]"<mailto:[hidden email]>  
> <[hidden email]><mailto:[hidden email]>
> Subject: Re: compiler is broken
>
> I guess mirror is broken, is it possible to set not to use mirror ?
> 14.12.2018 09:39 tarihinde Piotr Zarzycki yazdı:
> To me the other solution was as well downloading that file and setup  
> one of the environment variable CACHE - It always being checked  
> during compilation whether file exists there. If not we are trying  
> to download it.
>
> Find that variable if anything won't work.
>
> Thanks, Piotr
>
> czw., 13 gru 2018 o 23:17 Alex Harui  
> <[hidden email]<mailto:[hidden email]>> napisał(a):
> Usually, your default browser cache, but sometimes clearing the  
> Internet Explorer cache (even if you don’t use Internet Explorer)  
> can help.
>
> Try downloading the file manually by clicking that link in a browser  
> and run a checksum on the results and see you get something that can  
> be unzipped.
>
> HTH,
> -Alex
>
> From: Serkan Taş  
> <[hidden email]<mailto:[hidden email]>>
> Reply-To: "[hidden email]<mailto:[hidden email]>"  
> <[hidden email]<mailto:[hidden email]>>
> Date: Thursday, December 13, 2018 at 1:56 PM
> To: "[hidden email]<mailto:[hidden email]>"  
> <[hidden email]<mailto:[hidden email]>>
> Subject: Re: compiler is broken
>
> Hi Alex,
>
> Which browser cache should be cleaned ?
>
> Here is the download command from log :
>
> download_using_mirror:
>       [get] Getting:  
> http://www.apache.org/dyn/mirrors/mirrors.cgi/flex/flexunit/4.2.0/binaries/apache-flex-flexunit-4.2.0-4.12.0-bin.zip?asjson=true<https://na01.safelinks.protection.outlook.com/?url=http%3A%2F%2Fwww.apache.org%2Fdyn%2Fmirrors%2Fmirrors.cgi%2Fflex%2Fflexunit%2F4.2.0%2Fbinaries%2Fapache-flex-flexunit-4.2.0-4.12.0-bin.zip%3Fasjson%3Dtrue&data=02%7C01%7Caharui%40adobe.com%7Cc97a76315634490149ea08d666bc8acd%7Cfa7b1b5a7b34438794aed2c178decee1%7C0%7C0%7C636809357303689895&sdata=aodF192yIN%2BfahwQpFAcTMZ3VrbRto%2FJ81rwVqsJF3A%3D&reserved=0>
>       [get] To:  
> D:\dev\royale-emulation-works\github\royale-asjs\frameworks\mirror.json
>       [get] .
>
> check_mirror_json:
>
> use_mirror:
>    [delete] Deleting:  
> D:\dev\royale-emulation-works\github\royale-asjs\frameworks\mirror.json
>      [echo] Using mirror:  
> http://ftp.itu.edu.tr/Mirror/Apache/<https://na01.safelinks.protection.outlook.com/?url=http%3A%2F%2Fftp.itu.edu.tr%2FMirror%2FApache%2F&data=02%7C01%7Caharui%40adobe.com%7Cc97a76315634490149ea08d666bc8acd%7Cfa7b1b5a7b34438794aed2c178decee1%7C0%7C0%7C636809357303689895&sdata=1CaS1t5UGmZCvO%2BwdyaaDjhLHRYuS0pciQb4lmxIAGw%3D&reserved=0>
>       [get] Getting:  
> http://ftp.itu.edu.tr/Mirror/Apache/flex/flexunit/4.2.0/binaries/apache-flex-flexunit-4.2.0-4.12.0-bin.zip<https://na01.safelinks.protection.outlook.com/?url=http%3A%2F%2Fftp.itu.edu.tr%2FMirror%2FApache%2Fflex%2Fflexunit%2F4.2.0%2Fbinaries%2Fapache-flex-flexunit-4.2.0-4.12.0-bin.zip&data=02%7C01%7Caharui%40adobe.com%7Cc97a76315634490149ea08d666bc8acd%7Cfa7b1b5a7b34438794aed2c178decee1%7C0%7C0%7C636809357303689895&sdata=NAUeAoqK47%2BodW0qlUAP2EktQN4ouEMAibvsdqeVfUY%3D&reserved=0>
>       [get] To:  
> D:\dev\royale-emulation-works\github\royale-asjs\in\apache-flex-flexunit-4.2.0-4.12.0-bin.zip
>
>
>
> And full log for reference :  
> https://drive.google.com/open?id=14rWYkD--Dv89nw8H1lJ1Dymg4IQVznKg<https://na01.safelinks.protection.outlook.com/?url=https%3A%2F%2Fdrive.google.com%2Fopen%3Fid%3D14rWYkD--Dv89nw8H1lJ1Dymg4IQVznKg&data=02%7C01%7Caharui%40adobe.com%7Cc97a76315634490149ea08d666bc8acd%7Cfa7b1b5a7b34438794aed2c178decee1%7C0%7C0%7C636809357303689895&sdata=FChZmtGDz2oaeVxd%2B8JMIS7LTJVHCQw5CILHiw4tKJI%3D&reserved=0>
>
> Thanks,
> Serkan
> 11.12.2018 22:09 tarihinde Alex Harui yazdı:
> Hi Serkan,
>
> I don’t think that has anything to do with the compiler.  FlexUnit  
> is for ActionScript unit tests.  I suggest that you clear your  
> browser cache.  Sometimes the download libraries use browser  
> libraries and a bad version of a file will be in a browser cache.
>
> HTH,
> -Alex
>
> From: Serkan Taş  
> <[hidden email]><mailto:[hidden email]>
> Reply-To: "[hidden email]"<mailto:[hidden email]>  
> <[hidden email]><mailto:[hidden email]>
> Date: Tuesday, December 11, 2018 at 11:05 AM
> To: "[hidden email]"<mailto:[hidden email]>  
> <[hidden email]><mailto:[hidden email]>
> Subject: compiler is broken
>
> Hi,
>
> When compiling royale I am getting error below. Any one has idea ?
>
> Here is the end of the log :
>
> get-from-cache-if-needed:
>     [unzip] Expanding:  
> D:\dev\royale-emulation-works\github\royale-asjs\in\apache-flex-flexunit-4.2.0-4.12.0-bin.zip into  
> D:\dev\royale-emulation-works\github\royale-asjs\in\flexunit
>
> BUILD FAILED
> D:\dev\royale-emulation-works\github\royale-asjs\build.xml:193: The  
> following error occurred while executing this line:
> D:\dev\royale-emulation-works\github\royale-asjs\frameworks\build.xml:106:  
> The following error occurred while executing this line:
> D:\dev\royale-emulation-works\github\royale-asjs\frameworks\downloads.xml:110: Error while expanding  
> D:\dev\royale-emulation-works\github\royale-asjs\in\apache-flex-flexunit-4.2.0-4.12.0-bin.zip
> java.util.zip.ZipException: archive is not a ZIP archive
>         at  
> org.apache.tools.zip.ZipFile.positionAtEndOfCentralDirectoryRecord(ZipFile.java:775)
>         at  
> org.apache.tools.zip.ZipFile.positionAtCentralDirectory(ZipFile.java:711)
>         at  
> org.apache.tools.zip.ZipFile.populateFromCentralDirectory(ZipFile.java:456)
>         at org.apache.tools.zip.ZipFile.<init>(ZipFile.java:216)
>         at org.apache.tools.ant.taskdefs.Expand.expandFile(Expand.java:190)
>         at org.apache.tools.ant.taskdefs.Expand.execute(Expand.java:157)
>         at  
> org.apache.tools.ant.UnknownElement.execute(UnknownElement.java:292)
>         at sun.reflect.GeneratedMethodAccessor4.invoke(Unknown Source)
>         at  
> sun.reflect.DelegatingMethodAccessorImpl.invoke(DelegatingMethodAccessorImpl.java:43)
>         at java.lang.reflect.Method.invoke(Method.java:498)
>         at  
> org.apache.tools.ant.dispatch.DispatchUtils.execute(DispatchUtils.java:99)
>         at org.apache.tools.ant.Task.perform(Task.java:350)
>         at org.apache.tools.ant.Target.execute(Target.java:449)
>         at org.apache.tools.ant.Target.performTasks(Target.java:470)
>         at  
> org.apache.tools.ant.Project.executeSortedTargets(Project.java:1388)
>         at  
> org.apache.tools.ant.helper.SingleCheckExecutor.executeTargets(SingleCheckExecutor.java:36)
>         at org.apache.tools.ant.Project.executeTargets(Project.java:1251)
>         at org.apache.tools.ant.taskdefs.Ant.execute(Ant.java:437)
>         at  
> org.apache.tools.ant.UnknownElement.execute(UnknownElement.java:292)
>         at sun.reflect.GeneratedMethodAccessor4.invoke(Unknown Source)
>         at  
> sun.reflect.DelegatingMethodAccessorImpl.invoke(DelegatingMethodAccessorImpl.java:43)
>         at java.lang.reflect.Method.invoke(Method.java:498)
>         at  
> org.apache.tools.ant.dispatch.DispatchUtils.execute(DispatchUtils.java:99)
>         at org.apache.tools.ant.Task.perform(Task.java:350)
>         at org.apache.tools.ant.Target.execute(Target.java:449)
>         at org.apache.tools.ant.Target.performTasks(Target.java:470)
>         at  
> org.apache.tools.ant.Project.executeSortedTargets(Project.java:1388)
>         at  
> org.apache.tools.ant.helper.SingleCheckExecutor.executeTargets(SingleCheckExecutor.java:36)
>         at org.apache.tools.ant.Project.executeTargets(Project.java:1251)
>         at org.apache.tools.ant.taskdefs.Ant.execute(Ant.java:437)
>         at  
> org.apache.tools.ant.UnknownElement.execute(UnknownElement.java:292)
>         at sun.reflect.GeneratedMethodAccessor4.invoke(Unknown Source)
>         at  
> sun.reflect.DelegatingMethodAccessorImpl.invoke(DelegatingMethodAccessorImpl.java:43)
>         at java.lang.reflect.Method.invoke(Method.java:498)
>         at  
> org.apache.tools.ant.dispatch.DispatchUtils.execute(DispatchUtils.java:99)
>         at org.apache.tools.ant.Task.perform(Task.java:350)
>         at org.apache.tools.ant.Target.execute(Target.java:449)
>         at org.apache.tools.ant.Target.performTasks(Target.java:470)
>         at  
> org.apache.tools.ant.Project.executeSortedTargets(Project.java:1388)
>         at org.apache.tools.ant.Project.executeTarget(Project.java:1361)
>         at  
> org.apache.tools.ant.helper.DefaultExecutor.executeTargets(DefaultExecutor.java:41)
>         at org.apache.tools.ant.Project.executeTargets(Project.java:1251)
>         at org.apache.tools.ant.Main.runBuild(Main.java:834)
>         at org.apache.tools.ant.Main.startAnt(Main.java:223)
>         at org.apache.tools.ant.launch.Launcher.run(Launcher.java:284)
>         at org.apache.tools.ant.launch.Launcher.main(Launcher.java:101)
>
> Total time: 3 minutes 44 seconds
>
>
> Thanks,
> Serkan
>
>
>
>
>
>
>
>
> --
>
> Piotr Zarzycki
>
> Patreon:  
> https://www.patreon.com/piotrzarzycki<https://na01.safelinks.protection.outlook.com/?url=https%3A%2F%2Fwww.patreon.com%2Fpiotrzarzycki&data=02%7C01%7Caharui%40adobe.com%7Cc97a76315634490149ea08d666bc8acd%7Cfa7b1b5a7b34438794aed2c178decee1%7C0%7C0%7C636809357303689895&sdata=aH7HbDSTpGCWlBsLrcP8juqGLlbSxNvIOxce%2BhchiTM%3D&reserved=0>


--
Serkan Taş
Mobil : +90 532 250 07 71
Likya Bilgi Teknolojileri
ve İletişim Hiz. Ltd. Şti.
www.likyateknoloji.com

--------------------------------------
Bu elektronik posta ve onunla iletilen bütün dosyalar gizlidir. Sadece  
yukarıda isimleri belirtilen kişiler arasında özel haberleşme amacını  
taşımaktadır. Size yanlışlıkla ulaşmışsa bu elektonik postanın  
içeriğini açıklamanız, kopyalamanız, yönlendirmeniz ve kullanmanız  
kesinlikle yasaktır. Lütfen mesajı geri gönderiniz ve sisteminizden  
siliniz. Likya Bilgi Teknolojileri ve İletişim Hiz. Ltd. Şti. bu  
mesajın içeriği ile ilgili olarak hiç bir hukuksal sorumluluğu kabul  
etmez.

This electronic mail and any files transmitted with it are intended  
for the private use of  the persons named above. If you received this  
message in error, forwarding, copying or use of any of the information  
is strictly prohibited. Please immediately notify the sender and  
delete it from your system. Likya Bilgi Teknolojileri ve İletişim Hiz.  
Ltd. Şti. does not accept legal responsibility for the contents of  
this message.
--------------------------------------

Reply | Threaded
Open this post in threaded view
|

Re: compiler is broken

Alex Harui-2
Serkan,

It was not clear from your previous email whether there was more to the batch file or not.  I thought putting the flexunit zip in the "in" folder would prevent the ant script from trying to download it again, but I think it won't.

Let's try another approach:  I believe you have a valid zip of FlexUnit you downloaded manually at some point.  Put in a folder outside the repo folders, such as C:\temp

Then run:

ant -Dflexunit.url=file:///C: -Dflexunit.folder=temp

That should try to "download" your local valid zip.  If you get errors, check documentation on how to specify folders in Windows with file:// protocol.

HTH,
-Alex
   
    Hi Alex,
   
    I gave you the name and all content of the batch file, nothing more  
    and I use ant without target, do you want me to look in to build.xml  
    and choose a target ?
   
    name of file : .\royale-asjs-ant.bat
   
    All the the things inside :
   
    *********************************************************************************
    set PLAYERGLOBAL_HOME=D:/dev/royale-emulation-works/emulatedcomps
    set FLEX_HOME=D:/dev/Adobe/flex_sdk_4.6
    set GOOG_HOME=D:/dev/royale-emulation-works/closure-library-20180910
    set JAVA_TOOL_OPTIONS=-Dfile.encoding=UTF-8 -Duser.country=EN  
    -Duser.language=en
    (cd ..\github\royale-asjs && ant)
    *********************************************************************************
   
    I use batch to set env vars like JAVA_TOOL. No other third party  
    cleaning or maven.
   
    If you have any more questions, let me know.
   
    Thanks,
    Serkan
   
   
    Alinti Alex Harui <[hidden email]>
   
    > Serkan,
    >
    > It appears you are still using a batch file, and I cannot know what  
    > is in it, but earlier I explained that if you don’t run a  
    > super-clean or thirdparty-clean target and place a working flexunit  
    > zip file in the “in” folder, then the other ant targets should run  
    > without trying to download flexunit again.  That is how it works for  
    > the rest of us.
    >
    > Look in the console output.  If you see thirdparty-clean running,  
    > then you are still calling the wrong ant targets.
    >
    > -Alex
    >
    > From: Serkan Taş <[hidden email]>
    > Reply-To: "[hidden email]" <[hidden email]>
    > Date: Thursday, December 20, 2018 at 12:48 PM
    > To: "[hidden email]" <[hidden email]>
    > Subject: Re: compiler is broken
    >
    > I tried in all tree folders but royale-asjs fails with download error
    >
    > batch file :
    >
    >  .\royale-asjs-ant.bat
    > set PLAYERGLOBAL_HOME=D:/dev/royale-emulation-works/emulatedcomps
    > set FLEX_HOME=D:/dev/Adobe/flex_sdk_4.6
    > set GOOG_HOME=D:/dev/royale-emulation-works/closure-library-20180910
    > set JAVA_TOOL_OPTIONS=-Dfile.encoding=UTF-8 -Duser.country=EN  
    > -Duser.language=en
    > (cd ..\github\royale-asjs   && ant)
    >
    > result :
    >
    >
    > download_using_get:
    >
    > double-check-file:
    >      [echo] Need file: ${still_no_file}
    >
    > get-from-cache-if-needed:
    >     [unzip] Expanding:  
    > D:\dev\royale-emulation-works\github\royale-asjs\in\apache-flex-flexunit-4.2.0-4.12.0-bin.zip into  
    > D:\dev\royale-emulation-works\github\royale-asjs\in\flexunit
    >
    > BUILD FAILED
    > D:\dev\royale-emulation-works\github\royale-asjs\build.xml:193: The  
    > following error occurred while executing this line:
    > D:\dev\royale-emulation-works\github\royale-asjs\frameworks\build.xml:106:  
    > The following error occurred while executing this line:
    > D:\dev\royale-emulation-works\github\royale-asjs\frameworks\downloads.xml:110: Error while expanding  
    > D:\dev\royale-emulation-works\github\royale-asjs\in\apache-flex-flexunit-4.2.0-4.12.0-bin.zip
    > java.util.zip.ZipException: archive is not a ZIP archive
    >         at  
    > org.apache.tools.zip.ZipFile.positionAtEndOfCentralDirectoryRecord(ZipFile.java:775)
    >         at  
    > org.apache.tools.zip.ZipFile.positionAtCentralDirectory(ZipFile.java:711)
    >         at  
    > org.apache.tools.zip.ZipFile.populateFromCentralDirectory(ZipFile.java:456)
    >         at org.apache.tools.zip.ZipFile.<init>(ZipFile.java:216)
    >         at org.apache.tools.ant.taskdefs.Expand.expandFile(Expand.java:190)
    >         at org.apache.tools.ant.taskdefs.Expand.execute(Expand.java:157)
    >         at  
    > org.apache.tools.ant.UnknownElement.execute(UnknownElement.java:292)
    >         at sun.reflect.GeneratedMethodAccessor4.invoke(Unknown Source)
    >         at  
    > sun.reflect.DelegatingMethodAccessorImpl.invoke(DelegatingMethodAccessorImpl.java:43)
    >         at java.lang.reflect.Method.invoke(Method.java:498)
    >         at  
    > org.apache.tools.ant.dispatch.DispatchUtils.execute(DispatchUtils.java:99)
    >         at org.apache.tools.ant.Task.perform(Task.java:350)
    >         at org.apache.tools.ant.Target.execute(Target.java:449)
    >         at org.apache.tools.ant.Target.performTasks(Target.java:470)
    >         at  
    > org.apache.tools.ant.Project.executeSortedTargets(Project.java:1388)
    >         at  
    > org.apache.tools.ant.helper.SingleCheckExecutor.executeTargets(SingleCheckExecutor.java:36)
    >         at org.apache.tools.ant.Project.executeTargets(Project.java:1251)
    >         at org.apache.tools.ant.taskdefs.Ant.execute(Ant.java:437)
    >         at  
    > org.apache.tools.ant.UnknownElement.execute(UnknownElement.java:292)
    >         at sun.reflect.GeneratedMethodAccessor4.invoke(Unknown Source)
    >         at  
    > sun.reflect.DelegatingMethodAccessorImpl.invoke(DelegatingMethodAccessorImpl.java:43)
    >         at java.lang.reflect.Method.invoke(Method.java:498)
    >         at  
    > org.apache.tools.ant.dispatch.DispatchUtils.execute(DispatchUtils.java:99)
    >         at org.apache.tools.ant.Task.perform(Task.java:350)
    >         at org.apache.tools.ant.Target.execute(Target.java:449)
    >         at org.apache.tools.ant.Target.performTasks(Target.java:470)
    >         at  
    > org.apache.tools.ant.Project.executeSortedTargets(Project.java:1388)
    >         at  
    > org.apache.tools.ant.helper.SingleCheckExecutor.executeTargets(SingleCheckExecutor.java:36)
    >         at org.apache.tools.ant.Project.executeTargets(Project.java:1251)
    >         at org.apache.tools.ant.taskdefs.Ant.execute(Ant.java:437)
    >         at  
    > org.apache.tools.ant.UnknownElement.execute(UnknownElement.java:292)
    >         at sun.reflect.GeneratedMethodAccessor4.invoke(Unknown Source)
    >         at  
    > sun.reflect.DelegatingMethodAccessorImpl.invoke(DelegatingMethodAccessorImpl.java:43)
    >         at java.lang.reflect.Method.invoke(Method.java:498)
    >         at  
    > org.apache.tools.ant.dispatch.DispatchUtils.execute(DispatchUtils.java:99)
    >         at org.apache.tools.ant.Task.perform(Task.java:350)
    >         at org.apache.tools.ant.Target.execute(Target.java:449)
    >         at org.apache.tools.ant.Target.performTasks(Target.java:470)
    >         at  
    > org.apache.tools.ant.Project.executeSortedTargets(Project.java:1388)
    >         at org.apache.tools.ant.Project.executeTarget(Project.java:1361)
    >         at  
    > org.apache.tools.ant.helper.DefaultExecutor.executeTargets(DefaultExecutor.java:41)
    >         at org.apache.tools.ant.Project.executeTargets(Project.java:1251)
    >         at org.apache.tools.ant.Main.runBuild(Main.java:834)
    >         at org.apache.tools.ant.Main.startAnt(Main.java:223)
    >         at org.apache.tools.ant.launch.Launcher.run(Launcher.java:284)
    >         at org.apache.tools.ant.launch.Launcher.main(Launcher.java:101)
    >
    > Total time: 1 second
    >
    >
    > Thanks,
    > Serkan
    > 20.12.2018 01:52 tarihinde Alex Harui yazdı:
    > It seems like you have royale-asjs, royale-typedefs, and  
    > royale-compiler repos and are the batch file is trying to run Ant on  
    > it.  If you have that, you shouldn’t need everything in the batch  
    > file that comes before it, especially the Maven stuff.  Once you  
    > have the 3 repos, you should be able to run “ant” in any of them.
    >
    > -Alex
    >
    > From: Serkan Taş  
    > <[hidden email]><mailto:[hidden email]>
    > Reply-To: "[hidden email]"<mailto:[hidden email]>  
    > <[hidden email]><mailto:[hidden email]>
    > Date: Tuesday, December 18, 2018 at 11:15 AM
    > To: "[hidden email]"<mailto:[hidden email]>  
    > <[hidden email]><mailto:[hidden email]>
    > Subject: Re: compiler is broken
    >
    > Alex, I know your thoughts about custom build process, and trying to  
    > resolve it.
    >
    > But it needs some time to understand and implement, I am working on.
    >
    > Thanks,
    > Serkan
    > 18.12.2018 22:11 tarihinde Alex Harui yazdı:
    > Serkan,
    >
    > The build commands are in some batch file.  I cannot tell what is in  
    > it, but it appears to be calling the super-clean target which  
    > deletes the downloads.
    >
    > Again, this is the risk and inefficiencies of using a custom build process.
    >
    > -Alex
    >
    > From: Serkan Taş  
    > <[hidden email]><mailto:[hidden email]>
    > Reply-To: "[hidden email]"<mailto:[hidden email]>  
    > <[hidden email]><mailto:[hidden email]>
    > Date: Tuesday, December 18, 2018 at 10:36 AM
    > To: "[hidden email]"<mailto:[hidden email]>  
    > <[hidden email]><mailto:[hidden email]>
    > Subject: Re: compiler is broken
    >
    > Hi Alex,
    >
    > Here is the link of the log file including the build command :  
    > https://na01.safelinks.protection.outlook.com/?url=https%3A%2F%2Fdrive.google.com%2Fopen%3Fid%3D1i_4_0m0oVb06_N2ymFpbv14Dcs71KNR9&amp;data=02%7C01%7Caharui%40adobe.com%7Ce20a0b440ab741580b6c08d6671546e2%7Cfa7b1b5a7b34438794aed2c178decee1%7C0%7C0%7C636809738447592451&amp;sdata=xTPnv3MHBLen1vxFkkDJa0XzMbBT425inXHl4gkZtwQ%3D&amp;reserved=0<https://na01.safelinks.protection.outlook.com/?url=https%3A%2F%2Fdrive.google.com%2Fopen%3Fid%3D1i_4_0m0oVb06_N2ymFpbv14Dcs71KNR9&amp;data=02%7C01%7Caharui%40adobe.com%7Ce20a0b440ab741580b6c08d6671546e2%7Cfa7b1b5a7b34438794aed2c178decee1%7C0%7C0%7C636809738447592451&amp;sdata=xTPnv3MHBLen1vxFkkDJa0XzMbBT425inXHl4gkZtwQ%3D&amp;reserved=0>
    >
    > Why I think mirror is broken ?
    >
    > When I open the link :
    > https://na01.safelinks.protection.outlook.com/?url=http%3A%2F%2Fwww.apache.org%2Fdyn%2Fcloser.lua%2Fflex%2Fflexunit%2F4.2.0%2Fbinaries%2Fapache-flex-flexunit-4.2.0-4.12.0-bin.zip&amp;data=02%7C01%7Caharui%40adobe.com%7Ce20a0b440ab741580b6c08d6671546e2%7Cfa7b1b5a7b34438794aed2c178decee1%7C0%7C0%7C636809738447592451&amp;sdata=cYbqhZvQwiMv83IZqVfr5p5sSVt%2FhvrLpM02gHREC78%3D&amp;reserved=0<https://na01.safelinks.protection.outlook.com/?url=http%3A%2F%2Fwww.apache.org%2Fdyn%2Fcloser.lua%2Fflex%2Fflexunit%2F4.2.0%2Fbinaries%2Fapache-flex-flexunit-4.2.0-4.12.0-bin.zip&amp;data=02%7C01%7Caharui%40adobe.com%7Ce20a0b440ab741580b6c08d6671546e2%7Cfa7b1b5a7b34438794aed2c178decee1%7C0%7C0%7C636809738447592451&amp;sdata=cYbqhZvQwiMv83IZqVfr5p5sSVt%2FhvrLpM02gHREC78%3D&amp;reserved=0>
    >
    >
    > I see the links for the file  
    > apache-flex-flexunit-4.2.0-4.12.0-bin.zip<https://na01.safelinks.protection.outlook.com/?url=http%3A%2F%2Fftp.itu.edu.tr%2FMirror%2FApache%2Fflex%2Fflexunit%2F4.2.0%2Fbinaries%2Fapache-flex-flexunit-4.2.0-4.12.0-bin.zip&amp;data=02%7C01%7Caharui%40adobe.com%7Ce20a0b440ab741580b6c08d6671546e2%7Cfa7b1b5a7b34438794aed2c178decee1%7C0%7C0%7C636809738447592451&amp;sdata=LM%2FWwquskztwCSq1etXF0Uy0Tef9tH5tJucA%2FXt3O6o%3D&amp;reserved=0>
    >
    > When try to download with right-click-save-as for  
    > https://na01.safelinks.protection.outlook.com/?url=http%3A%2F%2Fftp.itu.edu.tr%2FMirror%2FApache%2Fflex%2Fflexunit%2F4.2.0%2Fbinaries%2Fapache-flex-flexunit-4.2.0-4.12.0-bin.zip&amp;data=02%7C01%7Caharui%40adobe.com%7Ce20a0b440ab741580b6c08d6671546e2%7Cfa7b1b5a7b34438794aed2c178decee1%7C0%7C0%7C636809738447592451&amp;sdata=LM%2FWwquskztwCSq1etXF0Uy0Tef9tH5tJucA%2FXt3O6o%3D&amp;reserved=0<https://na01.safelinks.protection.outlook.com/?url=http%3A%2F%2Fftp.itu.edu.tr%2FMirror%2FApache%2Fflex%2Fflexunit%2F4.2.0%2Fbinaries%2Fapache-flex-flexunit-4.2.0-4.12.0-bin.zip&amp;data=02%7C01%7Caharui%40adobe.com%7Ce20a0b440ab741580b6c08d6671546e2%7Cfa7b1b5a7b34438794aed2c178decee1%7C0%7C0%7C636809738447592451&amp;sdata=LM%2FWwquskztwCSq1etXF0Uy0Tef9tH5tJucA%2FXt3O6o%3D&amp;reserved=0>, I get file not  
    > downloaded.
    >
    > When try to download with right-click-save-as for
    > <https://na01.safelinks.protection.outlook.com/?url=http%3A%2F%2Fftp.itu.edu.tr%2FMirror%2FApache%2Fflex%2Fflexunit%2F4.2.0%2Fbinaries%2Fapache-flex-flexunit-4.2.0-4.12.0-bin.zip&amp;data=02%7C01%7Caharui%40adobe.com%7Ce20a0b440ab741580b6c08d6671546e2%7Cfa7b1b5a7b34438794aed2c178decee1%7C0%7C0%7C636809738447602456&amp;sdata=sO5K2OlMfKznX1S5h7xDWPwYlBw34hQT45Lfx35ar70%3D&amp;reserved=0>
    > ftp://ftp.itu.edu.tr/Mirror/Apache/flex/flexunit/4.2.0/binaries/apache-flex-flexunit-4.2.0-4.12.0-bin.zip
    > or
    > https://na01.safelinks.protection.outlook.com/?url=https%3A%2F%2Fwww-us.apache.org%2Fdist%2Fflex%2Fflexunit%2F4.2.0%2Fbinaries%2Fapache-flex-flexunit-4.2.0-4.12.0-bin.zip&amp;data=02%7C01%7Caharui%40adobe.com%7Ce20a0b440ab741580b6c08d6671546e2%7Cfa7b1b5a7b34438794aed2c178decee1%7C0%7C0%7C636809738447602456&amp;sdata=y0VqG%2Fhs2LCSCH95d8GyW5CHnWoumePxCUDzodpymXE%3D&amp;reserved=0<https://na01.safelinks.protection.outlook.com/?url=https%3A%2F%2Fwww-us.apache.org%2Fdist%2Fflex%2Fflexunit%2F4.2.0%2Fbinaries%2Fapache-flex-flexunit-4.2.0-4.12.0-bin.zip&amp;data=02%7C01%7Caharui%40adobe.com%7Ce20a0b440ab741580b6c08d6671546e2%7Cfa7b1b5a7b34438794aed2c178decee1%7C0%7C0%7C636809738447602456&amp;sdata=y0VqG%2Fhs2LCSCH95d8GyW5CHnWoumePxCUDzodpymXE%3D&amp;reserved=0>
    > or  
    > <https://na01.safelinks.protection.outlook.com/?url=http%3A%2F%2Fftp.itu.edu.tr%2FMirror%2FApache%2Fflex%2Fflexunit%2F4.2.0%2Fbinaries%2Fapache-flex-flexunit-4.2.0-4.12.0-bin.zip&amp;data=02%7C01%7Caharui%40adobe.com%7Ce20a0b440ab741580b6c08d6671546e2%7Cfa7b1b5a7b34438794aed2c178decee1%7C0%7C0%7C636809738447602456&amp;sdata=sO5K2OlMfKznX1S5h7xDWPwYlBw34hQT45Lfx35ar70%3D&amp;reserved=0>
    > <https://na01.safelinks.protection.outlook.com/?url=http%3A%2F%2Fftp.itu.edu.tr%2FMirror%2FApache%2Fflex%2Fflexunit%2F4.2.0%2Fbinaries%2Fapache-flex-flexunit-4.2.0-4.12.0-bin.zip&amp;data=02%7C01%7Caharui%40adobe.com%7Ce20a0b440ab741580b6c08d6671546e2%7Cfa7b1b5a7b34438794aed2c178decee1%7C0%7C0%7C636809738447602456&amp;sdata=sO5K2OlMfKznX1S5h7xDWPwYlBw34hQT45Lfx35ar70%3D&amp;reserved=0>https://na01.safelinks.protection.outlook.com/?url=https%3A%2F%2Fwww-eu.apache.org%2Fdist%2Fflex%2Fflexunit%2F4.2.0%2Fbinaries%2Fapache-flex-flexunit-4.2.0-4.12.0-bin.zip&amp;data=02%7C01%7Caharui%40adobe.com%7Ce20a0b440ab741580b6c08d6671546e2%7Cfa7b1b5a7b34438794aed2c178decee1%7C0%7C0%7C636809738447602456&amp;sdata=l7zq7RzcgkSOS1Wh3lxtZiHBQQlHmr0zg4iRT51fx3E%3D&amp;reserved=0<https://na01.safelinks.protection.outlook.com/?url=https%3A%2F%2Fwww-eu.apache.org%2Fdist%2Fflex%2Fflexunit%2F4.2.0%2Fbinaries%2Fapache-flex-flexunit-4.2.0-4.12.0-bin.zip&amp;data=02%7C01%7Caharui%40adobe.com%7Ce20a0b440ab741580b6c08d6671546e2%7Cfa7b1b5a7b34438794aed2c178decee1%7C0%7C0%7C636809738447602456&amp;sdata=l7zq7RzcgkSOS1Wh3lxtZiHBQQlHmr0zg4iRT51fx3E%3D&amp;reserved=0>
    >
    > I get file downloaded completely.
    >
    > But the compiler uses the first one.
    >
    > Let me know it you need more information.
    >
    > Thanks,
    > Serkan
    > 18.12.2018 01:33 tarihinde Alex Harui yazdı:
    > Serkan,
    >
    > What Ant targets are you running?  Post a link to the console output  
    > including the ant command.
    >
    > I’m not sure why you say the mirror and file are broken.  What  
    > errors are you getting that indicate that it is broken?
    >
    > -Alex
    >
    > From: Serkan Taş  
    > <[hidden email]><mailto:[hidden email]>
    > Reply-To: "[hidden email]"<mailto:[hidden email]>  
    > <[hidden email]><mailto:[hidden email]>
    > Date: Monday, December 17, 2018 at 12:52 PM
    > To: "[hidden email]"<mailto:[hidden email]>  
    > <[hidden email]><mailto:[hidden email]>
    > Subject: Re: compiler is broken
    >
    > Hi,
    >
    > When I downloaded the zip file from the link  
    > https://na01.safelinks.protection.outlook.com/?url=https%3A%2F%2Fwww-eu.apache.org%2Fdist%2Fflex%2Fflexunit%2F4.2.0%2Fbinaries%2Fapache-flex-flexunit-4.2.0-4.12.0-bin.zip&amp;data=02%7C01%7Caharui%40adobe.com%7Ce20a0b440ab741580b6c08d6671546e2%7Cfa7b1b5a7b34438794aed2c178decee1%7C0%7C0%7C636809738447602456&amp;sdata=l7zq7RzcgkSOS1Wh3lxtZiHBQQlHmr0zg4iRT51fx3E%3D&amp;reserved=0<https://na01.safelinks.protection.outlook.com/?url=https%3A%2F%2Fwww-eu.apache.org%2Fdist%2Fflex%2Fflexunit%2F4.2.0%2Fbinaries%2Fapache-flex-flexunit-4.2.0-4.12.0-bin.zip&amp;data=02%7C01%7Caharui%40adobe.com%7Ce20a0b440ab741580b6c08d6671546e2%7Cfa7b1b5a7b34438794aed2c178decee1%7C0%7C0%7C636809738447602456&amp;sdata=l7zq7RzcgkSOS1Wh3lxtZiHBQQlHmr0zg4iRT51fx3E%3D&amp;reserved=0>
    > and put it into the folder royale-asjs/in, I expected the compiler  
    > should not delete, bud done so.
    > Two problems here:
    >
    > 1. The mirror and the file in apache is somehow broken :(e.g)  
    > https://na01.safelinks.protection.outlook.com/?url=http%3A%2F%2Fwww.apache.org%2Fdyn%2Fcloser.lua%2Fflex%2Fflexunit%2F4.2.0%2Fbinaries%2Fapache-flex-flexunit-4.2.0-4.12.0-bin.zip&amp;data=02%7C01%7Caharui%40adobe.com%7Ce20a0b440ab741580b6c08d6671546e2%7Cfa7b1b5a7b34438794aed2c178decee1%7C0%7C0%7C636809738447602456&amp;sdata=rQu5PqfrrqDwgTzqtN7PyoOXJ7p1SCDBhEDrjsU4Z6s%3D&amp;reserved=0<https://na01.safelinks.protection.outlook.com/?url=http%3A%2F%2Fwww.apache.org%2Fdyn%2Fcloser.lua%2Fflex%2Fflexunit%2F4.2.0%2Fbinaries%2Fapache-flex-flexunit-4.2.0-4.12.0-bin.zip&amp;data=02%7C01%7Caharui%40adobe.com%7Ce20a0b440ab741580b6c08d6671546e2%7Cfa7b1b5a7b34438794aed2c178decee1%7C0%7C0%7C636809738447602456&amp;sdata=rQu5PqfrrqDwgTzqtN7PyoOXJ7p1SCDBhEDrjsU4Z6s%3D&amp;reserved=0>
    > 2. File are deleted and downloaded each time during the build.
    >
    > May give some idea.
    >
    > It is not blocking me for now as I am using nightly builds unit I find a fix.
    >
    > Thanks,
    > Serkan
    >
    > 16.12.2018 22:53 tarihinde Serkan Taş yazdı:
    > This time it is ok, I tired  
    > https://na01.safelinks.protection.outlook.com/?url=https%3A%2F%2Fwww-eu.apache.org%2Fdist%2Fflex%2Fflexunit%2F4.2.0%2Fbinaries%2Fapache-flex-flexunit-4.2.0-4.12.0-bin.zip&amp;data=02%7C01%7Caharui%40adobe.com%7Ce20a0b440ab741580b6c08d6671546e2%7Cfa7b1b5a7b34438794aed2c178decee1%7C0%7C0%7C636809738447612462&amp;sdata=CYk%2F%2BKHm3kTqsnFHSQA17cAknxf4vNfVuC5XRmRS6gk%3D&amp;reserved=0<https://na01.safelinks.protection.outlook.com/?url=https%3A%2F%2Fwww-eu.apache.org%2Fdist%2Fflex%2Fflexunit%2F4.2.0%2Fbinaries%2Fapache-flex-flexunit-4.2.0-4.12.0-bin.zip&amp;data=02%7C01%7Caharui%40adobe.com%7Ce20a0b440ab741580b6c08d6671546e2%7Cfa7b1b5a7b34438794aed2c178decee1%7C0%7C0%7C636809738447612462&amp;sdata=CYk%2F%2BKHm3kTqsnFHSQA17cAknxf4vNfVuC5XRmRS6gk%3D&amp;reserved=0>
    >
    > Thanks,
    > Serkan
    > 16.12.2018 22:42 tarihinde Serkan Taş yazdı:
    > The link is not working Alex, just 16K is downloaded may be it is  
    > related with my environment.
    >
    > Thanks,
    > Serkan
    > 16.12.2018 10:04 tarihinde Alex Harui yazdı:
    > Hmm.  Maybe the cgi isn’t working.
    >
    > Try:  
    > https://na01.safelinks.protection.outlook.com/?url=http%3A%2F%2Fwww.apache.org%2Fdyn%2Fcloser.lua%2Fflex%2Fflexunit%2F4.2.0%2Fbinaries%2Fapache-flex-flexunit-4.2.0-4.12.0-bin.zip&amp;data=02%7C01%7Caharui%40adobe.com%7Ce20a0b440ab741580b6c08d6671546e2%7Cfa7b1b5a7b34438794aed2c178decee1%7C0%7C0%7C636809738447612462&amp;sdata=IDJmbSRFmjJzEyeB5CK83iL1BxZdnphhFxcblMGEeC4%3D&amp;reserved=0<https://na01.safelinks.protection.outlook.com/?url=http%3A%2F%2Fwww.apache.org%2Fdyn%2Fcloser.lua%2Fflex%2Fflexunit%2F4.2.0%2Fbinaries%2Fapache-flex-flexunit-4.2.0-4.12.0-bin.zip&amp;data=02%7C01%7Caharui%40adobe.com%7Ce20a0b440ab741580b6c08d6671546e2%7Cfa7b1b5a7b34438794aed2c178decee1%7C0%7C0%7C636809738447612462&amp;sdata=IDJmbSRFmjJzEyeB5CK83iL1BxZdnphhFxcblMGEeC4%3D&amp;reserved=0>
    >
    > HTH,
    > -Alex
    >
    > From: Serkan Taş  
    > <[hidden email]><mailto:[hidden email]>
    > Reply-To: "[hidden email]"<mailto:[hidden email]>  
    > <[hidden email]><mailto:[hidden email]>
    > Date: Saturday, December 15, 2018 at 3:13 AM
    > To: "[hidden email]"<mailto:[hidden email]>  
    > <[hidden email]><mailto:[hidden email]>
    > Subject: Re: compiler is broken
    >
    > I guess mirror is broken, is it possible to set not to use mirror ?
    > 14.12.2018 09:39 tarihinde Piotr Zarzycki yazdı:
    > To me the other solution was as well downloading that file and setup  
    > one of the environment variable CACHE - It always being checked  
    > during compilation whether file exists there. If not we are trying  
    > to download it.
    >
    > Find that variable if anything won't work.
    >
    > Thanks, Piotr
    >
    > czw., 13 gru 2018 o 23:17 Alex Harui  
    > <[hidden email]<mailto:[hidden email]>> napisał(a):
    > Usually, your default browser cache, but sometimes clearing the  
    > Internet Explorer cache (even if you don’t use Internet Explorer)  
    > can help.
    >
    > Try downloading the file manually by clicking that link in a browser  
    > and run a checksum on the results and see you get something that can  
    > be unzipped.
    >
    > HTH,
    > -Alex
    >
    > From: Serkan Taş  
    > <[hidden email]<mailto:[hidden email]>>
    > Reply-To: "[hidden email]<mailto:[hidden email]>"  
    > <[hidden email]<mailto:[hidden email]>>
    > Date: Thursday, December 13, 2018 at 1:56 PM
    > To: "[hidden email]<mailto:[hidden email]>"  
    > <[hidden email]<mailto:[hidden email]>>
    > Subject: Re: compiler is broken
    >
    > Hi Alex,
    >
    > Which browser cache should be cleaned ?
    >
    > Here is the download command from log :
    >
    > download_using_mirror:
    >       [get] Getting:  
    > https://na01.safelinks.protection.outlook.com/?url=http%3A%2F%2Fwww.apache.org%2Fdyn%2Fmirrors%2Fmirrors.cgi%2Fflex%2Fflexunit%2F4.2.0%2Fbinaries%2Fapache-flex-flexunit-4.2.0-4.12.0-bin.zip%3Fasjson%3Dtrue&amp;data=02%7C01%7Caharui%40adobe.com%7Ce20a0b440ab741580b6c08d6671546e2%7Cfa7b1b5a7b34438794aed2c178decee1%7C0%7C0%7C636809738447612462&amp;sdata=t4pFWAfEx28ru9js2qSh1f10lIvxrvVNRVpVLeCyZco%3D&amp;reserved=0<https://na01.safelinks.protection.outlook.com/?url=http%3A%2F%2Fwww.apache.org%2Fdyn%2Fmirrors%2Fmirrors.cgi%2Fflex%2Fflexunit%2F4.2.0%2Fbinaries%2Fapache-flex-flexunit-4.2.0-4.12.0-bin.zip%3Fasjson%3Dtrue&amp;data=02%7C01%7Caharui%40adobe.com%7Ce20a0b440ab741580b6c08d6671546e2%7Cfa7b1b5a7b34438794aed2c178decee1%7C0%7C0%7C636809738447612462&amp;sdata=t4pFWAfEx28ru9js2qSh1f10lIvxrvVNRVpVLeCyZco%3D&amp;reserved=0>
    >       [get] To:  
    > D:\dev\royale-emulation-works\github\royale-asjs\frameworks\mirror.json
    >       [get] .
    >
    > check_mirror_json:
    >
    > use_mirror:
    >    [delete] Deleting:  
    > D:\dev\royale-emulation-works\github\royale-asjs\frameworks\mirror.json
    >      [echo] Using mirror:  
    > https://na01.safelinks.protection.outlook.com/?url=http%3A%2F%2Fftp.itu.edu.tr%2FMirror%2FApache%2F&amp;data=02%7C01%7Caharui%40adobe.com%7Ce20a0b440ab741580b6c08d6671546e2%7Cfa7b1b5a7b34438794aed2c178decee1%7C0%7C0%7C636809738447612462&amp;sdata=mzbWZSmmHaCFGp9zejg0tBZtDEFzdkDQpGMOouoDqcY%3D&amp;reserved=0<https://na01.safelinks.protection.outlook.com/?url=http%3A%2F%2Fftp.itu.edu.tr%2FMirror%2FApache%2F&amp;data=02%7C01%7Caharui%40adobe.com%7Ce20a0b440ab741580b6c08d6671546e2%7Cfa7b1b5a7b34438794aed2c178decee1%7C0%7C0%7C636809738447612462&amp;sdata=mzbWZSmmHaCFGp9zejg0tBZtDEFzdkDQpGMOouoDqcY%3D&amp;reserved=0>
    >       [get] Getting:  
    > https://na01.safelinks.protection.outlook.com/?url=http%3A%2F%2Fftp.itu.edu.tr%2FMirror%2FApache%2Fflex%2Fflexunit%2F4.2.0%2Fbinaries%2Fapache-flex-flexunit-4.2.0-4.12.0-bin.zip&amp;data=02%7C01%7Caharui%40adobe.com%7Ce20a0b440ab741580b6c08d6671546e2%7Cfa7b1b5a7b34438794aed2c178decee1%7C0%7C0%7C636809738447612462&amp;sdata=otrhsbYcTHzs%2Bq4xZbP3D6m%2Fl%2FAYTeqALWHexQoFhwU%3D&amp;reserved=0<https://na01.safelinks.protection.outlook.com/?url=http%3A%2F%2Fftp.itu.edu.tr%2FMirror%2FApache%2Fflex%2Fflexunit%2F4.2.0%2Fbinaries%2Fapache-flex-flexunit-4.2.0-4.12.0-bin.zip&amp;data=02%7C01%7Caharui%40adobe.com%7Ce20a0b440ab741580b6c08d6671546e2%7Cfa7b1b5a7b34438794aed2c178decee1%7C0%7C0%7C636809738447612462&amp;sdata=otrhsbYcTHzs%2Bq4xZbP3D6m%2Fl%2FAYTeqALWHexQoFhwU%3D&amp;reserved=0>
    >       [get] To:  
    > D:\dev\royale-emulation-works\github\royale-asjs\in\apache-flex-flexunit-4.2.0-4.12.0-bin.zip
    >
    >
    >
    > And full log for reference :  
    > https://na01.safelinks.protection.outlook.com/?url=https%3A%2F%2Fdrive.google.com%2Fopen%3Fid%3D14rWYkD--Dv89nw8H1lJ1Dymg4IQVznKg&amp;data=02%7C01%7Caharui%40adobe.com%7Ce20a0b440ab741580b6c08d6671546e2%7Cfa7b1b5a7b34438794aed2c178decee1%7C0%7C0%7C636809738447612462&amp;sdata=r6j8hg%2BcVzfu7y4KzI6FfyT4rIJefXZkGBOWmg9dPfk%3D&amp;reserved=0<https://na01.safelinks.protection.outlook.com/?url=https%3A%2F%2Fdrive.google.com%2Fopen%3Fid%3D14rWYkD--Dv89nw8H1lJ1Dymg4IQVznKg&amp;data=02%7C01%7Caharui%40adobe.com%7Ce20a0b440ab741580b6c08d6671546e2%7Cfa7b1b5a7b34438794aed2c178decee1%7C0%7C0%7C636809738447612462&amp;sdata=r6j8hg%2BcVzfu7y4KzI6FfyT4rIJefXZkGBOWmg9dPfk%3D&amp;reserved=0>
    >
    > Thanks,
    > Serkan
    > 11.12.2018 22:09 tarihinde Alex Harui yazdı:
    > Hi Serkan,
    >
    > I don’t think that has anything to do with the compiler.  FlexUnit  
    > is for ActionScript unit tests.  I suggest that you clear your  
    > browser cache.  Sometimes the download libraries use browser  
    > libraries and a bad version of a file will be in a browser cache.
    >
    > HTH,
    > -Alex
    >
    > From: Serkan Taş  
    > <[hidden email]><mailto:[hidden email]>
    > Reply-To: "[hidden email]"<mailto:[hidden email]>  
    > <[hidden email]><mailto:[hidden email]>
    > Date: Tuesday, December 11, 2018 at 11:05 AM
    > To: "[hidden email]"<mailto:[hidden email]>  
    > <[hidden email]><mailto:[hidden email]>
    > Subject: compiler is broken
    >
    > Hi,
    >
    > When compiling royale I am getting error below. Any one has idea ?
    >
    > Here is the end of the log :
    >
    > get-from-cache-if-needed:
    >     [unzip] Expanding:  
    > D:\dev\royale-emulation-works\github\royale-asjs\in\apache-flex-flexunit-4.2.0-4.12.0-bin.zip into  
    > D:\dev\royale-emulation-works\github\royale-asjs\in\flexunit
    >
    > BUILD FAILED
    > D:\dev\royale-emulation-works\github\royale-asjs\build.xml:193: The  
    > following error occurred while executing this line:
    > D:\dev\royale-emulation-works\github\royale-asjs\frameworks\build.xml:106:  
    > The following error occurred while executing this line:
    > D:\dev\royale-emulation-works\github\royale-asjs\frameworks\downloads.xml:110: Error while expanding  
    > D:\dev\royale-emulation-works\github\royale-asjs\in\apache-flex-flexunit-4.2.0-4.12.0-bin.zip
    > java.util.zip.ZipException: archive is not a ZIP archive
    >         at  
    > org.apache.tools.zip.ZipFile.positionAtEndOfCentralDirectoryRecord(ZipFile.java:775)
    >         at  
    > org.apache.tools.zip.ZipFile.positionAtCentralDirectory(ZipFile.java:711)
    >         at  
    > org.apache.tools.zip.ZipFile.populateFromCentralDirectory(ZipFile.java:456)
    >         at org.apache.tools.zip.ZipFile.<init>(ZipFile.java:216)
    >         at org.apache.tools.ant.taskdefs.Expand.expandFile(Expand.java:190)
    >         at org.apache.tools.ant.taskdefs.Expand.execute(Expand.java:157)
    >         at  
    > org.apache.tools.ant.UnknownElement.execute(UnknownElement.java:292)
    >         at sun.reflect.GeneratedMethodAccessor4.invoke(Unknown Source)
    >         at  
    > sun.reflect.DelegatingMethodAccessorImpl.invoke(DelegatingMethodAccessorImpl.java:43)
    >         at java.lang.reflect.Method.invoke(Method.java:498)
    >         at  
    > org.apache.tools.ant.dispatch.DispatchUtils.execute(DispatchUtils.java:99)
    >         at org.apache.tools.ant.Task.perform(Task.java:350)
    >         at org.apache.tools.ant.Target.execute(Target.java:449)
    >         at org.apache.tools.ant.Target.performTasks(Target.java:470)
    >         at  
    > org.apache.tools.ant.Project.executeSortedTargets(Project.java:1388)
    >         at  
    > org.apache.tools.ant.helper.SingleCheckExecutor.executeTargets(SingleCheckExecutor.java:36)
    >         at org.apache.tools.ant.Project.executeTargets(Project.java:1251)
    >         at org.apache.tools.ant.taskdefs.Ant.execute(Ant.java:437)
    >         at  
    > org.apache.tools.ant.UnknownElement.execute(UnknownElement.java:292)
    >         at sun.reflect.GeneratedMethodAccessor4.invoke(Unknown Source)
    >         at  
    > sun.reflect.DelegatingMethodAccessorImpl.invoke(DelegatingMethodAccessorImpl.java:43)
    >         at java.lang.reflect.Method.invoke(Method.java:498)
    >         at  
    > org.apache.tools.ant.dispatch.DispatchUtils.execute(DispatchUtils.java:99)
    >         at org.apache.tools.ant.Task.perform(Task.java:350)
    >         at org.apache.tools.ant.Target.execute(Target.java:449)
    >         at org.apache.tools.ant.Target.performTasks(Target.java:470)
    >         at  
    > org.apache.tools.ant.Project.executeSortedTargets(Project.java:1388)
    >         at  
    > org.apache.tools.ant.helper.SingleCheckExecutor.executeTargets(SingleCheckExecutor.java:36)
    >         at org.apache.tools.ant.Project.executeTargets(Project.java:1251)
    >         at org.apache.tools.ant.taskdefs.Ant.execute(Ant.java:437)
    >         at  
    > org.apache.tools.ant.UnknownElement.execute(UnknownElement.java:292)
    >         at sun.reflect.GeneratedMethodAccessor4.invoke(Unknown Source)
    >         at  
    > sun.reflect.DelegatingMethodAccessorImpl.invoke(DelegatingMethodAccessorImpl.java:43)
    >         at java.lang.reflect.Method.invoke(Method.java:498)
    >         at  
    > org.apache.tools.ant.dispatch.DispatchUtils.execute(DispatchUtils.java:99)
    >         at org.apache.tools.ant.Task.perform(Task.java:350)
    >         at org.apache.tools.ant.Target.execute(Target.java:449)
    >         at org.apache.tools.ant.Target.performTasks(Target.java:470)
    >         at  
    > org.apache.tools.ant.Project.executeSortedTargets(Project.java:1388)
    >         at org.apache.tools.ant.Project.executeTarget(Project.java:1361)
    >         at  
    > org.apache.tools.ant.helper.DefaultExecutor.executeTargets(DefaultExecutor.java:41)
    >         at org.apache.tools.ant.Project.executeTargets(Project.java:1251)
    >         at org.apache.tools.ant.Main.runBuild(Main.java:834)
    >         at org.apache.tools.ant.Main.startAnt(Main.java:223)
    >         at org.apache.tools.ant.launch.Launcher.run(Launcher.java:284)
    >         at org.apache.tools.ant.launch.Launcher.main(Launcher.java:101)
    >
    > Total time: 3 minutes 44 seconds
    >
    >
    > Thanks,
    > Serkan
    >
    >
    >
    >
    >
    >
    >
    >
    > --
    >
    > Piotr Zarzycki
    >
    > Patreon:  
    > https://na01.safelinks.protection.outlook.com/?url=https%3A%2F%2Fwww.patreon.com%2Fpiotrzarzycki&amp;data=02%7C01%7Caharui%40adobe.com%7Ce20a0b440ab741580b6c08d6671546e2%7Cfa7b1b5a7b34438794aed2c178decee1%7C0%7C0%7C636809738447612462&amp;sdata=V%2BqbIuLoKZc443DtFZCH4t7k33NqPWNsCEATbbUhHC8%3D&amp;reserved=0<https://na01.safelinks.protection.outlook.com/?url=https%3A%2F%2Fwww.patreon.com%2Fpiotrzarzycki&amp;data=02%7C01%7Caharui%40adobe.com%7Ce20a0b440ab741580b6c08d6671546e2%7Cfa7b1b5a7b34438794aed2c178decee1%7C0%7C0%7C636809738447622476&amp;sdata=85onqL5u2NcsabQdJOAnR6Fp70cCE8%2FydARtBdr0NTs%3D&amp;reserved=0>
   
   
    --
    Serkan Taş
    Mobil : +90 532 250 07 71
    Likya Bilgi Teknolojileri
    ve İletişim Hiz. Ltd. Şti.
    https://na01.safelinks.protection.outlook.com/?url=www.likyateknoloji.com&amp;data=02%7C01%7Caharui%40adobe.com%7Ce20a0b440ab741580b6c08d6671546e2%7Cfa7b1b5a7b34438794aed2c178decee1%7C0%7C0%7C636809738447622476&amp;sdata=7kHkmhUN0TeV8xoTrPGl8rFt2Jjiyap2EBXRYl959Ik%3D&amp;reserved=0
   
    --------------------------------------
    Bu elektronik posta ve onunla iletilen bütün dosyalar gizlidir. Sadece  
    yukarıda isimleri belirtilen kişiler arasında özel haberleşme amacını  
    taşımaktadır. Size yanlışlıkla ulaşmışsa bu elektonik postanın  
    içeriğini açıklamanız, kopyalamanız, yönlendirmeniz ve kullanmanız  
    kesinlikle yasaktır. Lütfen mesajı geri gönderiniz ve sisteminizden  
    siliniz. Likya Bilgi Teknolojileri ve İletişim Hiz. Ltd. Şti. bu  
    mesajın içeriği ile ilgili olarak hiç bir hukuksal sorumluluğu kabul  
    etmez.
   
    This electronic mail and any files transmitted with it are intended  
    for the private use of  the persons named above. If you received this  
    message in error, forwarding, copying or use of any of the information  
    is strictly prohibited. Please immediately notify the sender and  
    delete it from your system. Likya Bilgi Teknolojileri ve İletişim Hiz.  
    Ltd. Şti. does not accept legal responsibility for the contents of  
    this message.
    --------------------------------------
   
   

Reply | Threaded
Open this post in threaded view
|

Re: compiler is broken

Serkan Taş
Hi Alex,

After putting the per-downloaded archive to the local folder and adding the path declarations for the junit dependencies through env var, despite ant args, the build process successfully completed

for reference : set JAVA_TOOL_OPTIONS=-Dfile.encoding=UTF-8 -Duser.country=EN -Duser.language=en -Dflexunit.url=file:///D:/dev/royale-emulation-works/github -Dflexunit.folder=.

I can see the that MXRoyaleJS.swc and SparkRoyaleJS.swc are generated. Currently not required but I would like to ask how can I generate the swf counterparts because  they are  are missing or I do not know where to find.

Thanks,
Serkan


21.12.2018 10:41 tarihinde Alex Harui yazdı:
Serkan,

It was not clear from your previous email whether there was more to the batch file or not.  I thought putting the flexunit zip in the "in" folder would prevent the ant script from trying to download it again, but I think it won't.

Let's try another approach:  I believe you have a valid zip of FlexUnit you downloaded manually at some point.  Put in a folder outside the repo folders, such as C:\temp

Then run:

ant -Dflexunit.url=file:///C: -Dflexunit.folder=temp

That should try to "download" your local valid zip.  If you get errors, check documentation on how to specify folders in Windows with <a class="moz-txt-link-freetext" href="file://">file:// protocol.

HTH,
-Alex
    
    Hi Alex,
    
    I gave you the name and all content of the batch file, nothing more  
    and I use ant without target, do you want me to look in to build.xml  
    and choose a target ?
    
    name of file : .\royale-asjs-ant.bat
    
    All the the things inside :
    
    *********************************************************************************
    set PLAYERGLOBAL_HOME=D:/dev/royale-emulation-works/emulatedcomps
    set FLEX_HOME=D:/dev/Adobe/flex_sdk_4.6
    set GOOG_HOME=D:/dev/royale-emulation-works/closure-library-20180910
    set JAVA_TOOL_OPTIONS=-Dfile.encoding=UTF-8 -Duser.country=EN  
    -Duser.language=en
    (cd ..\github\royale-asjs && ant)
    *********************************************************************************
    
    I use batch to set env vars like JAVA_TOOL. No other third party  
    cleaning or maven.
    
    If you have any more questions, let me know.
    
    Thanks,
    Serkan
    
    
    Alinti Alex Harui [hidden email]
    
    > Serkan,
    >
    > It appears you are still using a batch file, and I cannot know what  
    > is in it, but earlier I explained that if you don’t run a  
    > super-clean or thirdparty-clean target and place a working flexunit  
    > zip file in the “in” folder, then the other ant targets should run  
    > without trying to download flexunit again.  That is how it works for  
    > the rest of us.
    >
    > Look in the console output.  If you see thirdparty-clean running,  
    > then you are still calling the wrong ant targets.
    >
    > -Alex
    >
    > From: Serkan Taş [hidden email]
    > Reply-To: [hidden email] [hidden email]
    > Date: Thursday, December 20, 2018 at 12:48 PM
    > To: [hidden email] [hidden email]
    > Subject: Re: compiler is broken
    >
    > I tried in all tree folders but royale-asjs fails with download error
    >
    > batch file :
    >
    >  .\royale-asjs-ant.bat
    > set PLAYERGLOBAL_HOME=D:/dev/royale-emulation-works/emulatedcomps
    > set FLEX_HOME=D:/dev/Adobe/flex_sdk_4.6
    > set GOOG_HOME=D:/dev/royale-emulation-works/closure-library-20180910
    > set JAVA_TOOL_OPTIONS=-Dfile.encoding=UTF-8 -Duser.country=EN  
    > -Duser.language=en
    > (cd ..\github\royale-asjs   && ant)
    >
    > result :
    >
    >
    > download_using_get:
    >
    > double-check-file:
    >      [echo] Need file: ${still_no_file}
    >
    > get-from-cache-if-needed:
    >     [unzip] Expanding:  
    > D:\dev\royale-emulation-works\github\royale-asjs\in\apache-flex-flexunit-4.2.0-4.12.0-bin.zip into  
    > D:\dev\royale-emulation-works\github\royale-asjs\in\flexunit
    >
    > BUILD FAILED
    > D:\dev\royale-emulation-works\github\royale-asjs\build.xml:193: The  
    > following error occurred while executing this line:
    > D:\dev\royale-emulation-works\github\royale-asjs\frameworks\build.xml:106:  
    > The following error occurred while executing this line:
    > D:\dev\royale-emulation-works\github\royale-asjs\frameworks\downloads.xml:110: Error while expanding  
    > D:\dev\royale-emulation-works\github\royale-asjs\in\apache-flex-flexunit-4.2.0-4.12.0-bin.zip
    > java.util.zip.ZipException: archive is not a ZIP archive
    >         at  
    > org.apache.tools.zip.ZipFile.positionAtEndOfCentralDirectoryRecord(ZipFile.java:775)
    >         at  
    > org.apache.tools.zip.ZipFile.positionAtCentralDirectory(ZipFile.java:711)
    >         at  
    > org.apache.tools.zip.ZipFile.populateFromCentralDirectory(ZipFile.java:456)
    >         at org.apache.tools.zip.ZipFile.<init>(ZipFile.java:216)
    >         at org.apache.tools.ant.taskdefs.Expand.expandFile(Expand.java:190)
    >         at org.apache.tools.ant.taskdefs.Expand.execute(Expand.java:157)
    >         at  
    > org.apache.tools.ant.UnknownElement.execute(UnknownElement.java:292)
    >         at sun.reflect.GeneratedMethodAccessor4.invoke(Unknown Source)
    >         at  
    > sun.reflect.DelegatingMethodAccessorImpl.invoke(DelegatingMethodAccessorImpl.java:43)
    >         at java.lang.reflect.Method.invoke(Method.java:498)
    >         at  
    > org.apache.tools.ant.dispatch.DispatchUtils.execute(DispatchUtils.java:99)
    >         at org.apache.tools.ant.Task.perform(Task.java:350)
    >         at org.apache.tools.ant.Target.execute(Target.java:449)
    >         at org.apache.tools.ant.Target.performTasks(Target.java:470)
    >         at  
    > org.apache.tools.ant.Project.executeSortedTargets(Project.java:1388)
    >         at  
    > org.apache.tools.ant.helper.SingleCheckExecutor.executeTargets(SingleCheckExecutor.java:36)
    >         at org.apache.tools.ant.Project.executeTargets(Project.java:1251)
    >         at org.apache.tools.ant.taskdefs.Ant.execute(Ant.java:437)
    >         at  
    > org.apache.tools.ant.UnknownElement.execute(UnknownElement.java:292)
    >         at sun.reflect.GeneratedMethodAccessor4.invoke(Unknown Source)
    >         at  
    > sun.reflect.DelegatingMethodAccessorImpl.invoke(DelegatingMethodAccessorImpl.java:43)
    >         at java.lang.reflect.Method.invoke(Method.java:498)
    >         at  
    > org.apache.tools.ant.dispatch.DispatchUtils.execute(DispatchUtils.java:99)
    >         at org.apache.tools.ant.Task.perform(Task.java:350)
    >         at org.apache.tools.ant.Target.execute(Target.java:449)
    >         at org.apache.tools.ant.Target.performTasks(Target.java:470)
    >         at  
    > org.apache.tools.ant.Project.executeSortedTargets(Project.java:1388)
    >         at  
    > org.apache.tools.ant.helper.SingleCheckExecutor.executeTargets(SingleCheckExecutor.java:36)
    >         at org.apache.tools.ant.Project.executeTargets(Project.java:1251)
    >         at org.apache.tools.ant.taskdefs.Ant.execute(Ant.java:437)
    >         at  
    > org.apache.tools.ant.UnknownElement.execute(UnknownElement.java:292)
    >         at sun.reflect.GeneratedMethodAccessor4.invoke(Unknown Source)
    >         at  
    > sun.reflect.DelegatingMethodAccessorImpl.invoke(DelegatingMethodAccessorImpl.java:43)
    >         at java.lang.reflect.Method.invoke(Method.java:498)
    >         at  
    > org.apache.tools.ant.dispatch.DispatchUtils.execute(DispatchUtils.java:99)
    >         at org.apache.tools.ant.Task.perform(Task.java:350)
    >         at org.apache.tools.ant.Target.execute(Target.java:449)
    >         at org.apache.tools.ant.Target.performTasks(Target.java:470)
    >         at  
    > org.apache.tools.ant.Project.executeSortedTargets(Project.java:1388)
    >         at org.apache.tools.ant.Project.executeTarget(Project.java:1361)
    >         at  
    > org.apache.tools.ant.helper.DefaultExecutor.executeTargets(DefaultExecutor.java:41)
    >         at org.apache.tools.ant.Project.executeTargets(Project.java:1251)
    >         at org.apache.tools.ant.Main.runBuild(Main.java:834)
    >         at org.apache.tools.ant.Main.startAnt(Main.java:223)
    >         at org.apache.tools.ant.launch.Launcher.run(Launcher.java:284)
    >         at org.apache.tools.ant.launch.Launcher.main(Launcher.java:101)
    >
    > Total time: 1 second
    >
    >
    > Thanks,
    > Serkan
    > 20.12.2018 01:52 tarihinde Alex Harui yazdı:
    > It seems like you have royale-asjs, royale-typedefs, and  
    > royale-compiler repos and are the batch file is trying to run Ant on  
    > it.  If you have that, you shouldn’t need everything in the batch  
    > file that comes before it, especially the Maven stuff.  Once you  
    > have the 3 repos, you should be able to run “ant” in any of them.
    >
    > -Alex
    >
    > From: Serkan Taş  
    > [hidden email][hidden email]
    > Reply-To: [hidden email][hidden email]  
    > [hidden email][hidden email]
    > Date: Tuesday, December 18, 2018 at 11:15 AM
    > To: [hidden email][hidden email]  
    > [hidden email][hidden email]
    > Subject: Re: compiler is broken
    >
    > Alex, I know your thoughts about custom build process, and trying to  
    > resolve it.
    >
    > But it needs some time to understand and implement, I am working on.
    >
    > Thanks,
    > Serkan
    > 18.12.2018 22:11 tarihinde Alex Harui yazdı:
    > Serkan,
    >
    > The build commands are in some batch file.  I cannot tell what is in  
    > it, but it appears to be calling the super-clean target which  
    > deletes the downloads.
    >
    > Again, this is the risk and inefficiencies of using a custom build process.
    >
    > -Alex
    >
    > From: Serkan Taş  
    > [hidden email][hidden email]
    > Reply-To: [hidden email][hidden email]  
    > [hidden email][hidden email]
    > Date: Tuesday, December 18, 2018 at 10:36 AM
    > To: [hidden email][hidden email]  
    > [hidden email][hidden email]
    > Subject: Re: compiler is broken
    >
    > Hi Alex,
    >
    > Here is the link of the log file including the build command :  
    > https://na01.safelinks.protection.outlook.com/?url=https%3A%2F%2Fdrive.google.com%2Fopen%3Fid%3D1i_4_0m0oVb06_N2ymFpbv14Dcs71KNR9&amp;data=02%7C01%7Caharui%40adobe.com%7Ce20a0b440ab741580b6c08d6671546e2%7Cfa7b1b5a7b34438794aed2c178decee1%7C0%7C0%7C636809738447592451&amp;sdata=xTPnv3MHBLen1vxFkkDJa0XzMbBT425inXHl4gkZtwQ%3D&amp;reserved=0<https://na01.safelinks.protection.outlook.com/?url=https%3A%2F%2Fdrive.google.com%2Fopen%3Fid%3D1i_4_0m0oVb06_N2ymFpbv14Dcs71KNR9&amp;data=02%7C01%7Caharui%40adobe.com%7Ce20a0b440ab741580b6c08d6671546e2%7Cfa7b1b5a7b34438794aed2c178decee1%7C0%7C0%7C636809738447592451&amp;sdata=xTPnv3MHBLen1vxFkkDJa0XzMbBT425inXHl4gkZtwQ%3D&amp;reserved=0>
    >
    > Why I think mirror is broken ?
    >
    > When I open the link :
    > https://na01.safelinks.protection.outlook.com/?url=http%3A%2F%2Fwww.apache.org%2Fdyn%2Fcloser.lua%2Fflex%2Fflexunit%2F4.2.0%2Fbinaries%2Fapache-flex-flexunit-4.2.0-4.12.0-bin.zip&amp;data=02%7C01%7Caharui%40adobe.com%7Ce20a0b440ab741580b6c08d6671546e2%7Cfa7b1b5a7b34438794aed2c178decee1%7C0%7C0%7C636809738447592451&amp;sdata=cYbqhZvQwiMv83IZqVfr5p5sSVt%2FhvrLpM02gHREC78%3D&amp;reserved=0<https://na01.safelinks.protection.outlook.com/?url=http%3A%2F%2Fwww.apache.org%2Fdyn%2Fcloser.lua%2Fflex%2Fflexunit%2F4.2.0%2Fbinaries%2Fapache-flex-flexunit-4.2.0-4.12.0-bin.zip&amp;data=02%7C01%7Caharui%40adobe.com%7Ce20a0b440ab741580b6c08d6671546e2%7Cfa7b1b5a7b34438794aed2c178decee1%7C0%7C0%7C636809738447592451&amp;sdata=cYbqhZvQwiMv83IZqVfr5p5sSVt%2FhvrLpM02gHREC78%3D&amp;reserved=0>
    >
    >
    > I see the links for the file  
    > apache-flex-flexunit-4.2.0-4.12.0-bin.zip<https://na01.safelinks.protection.outlook.com/?url=http%3A%2F%2Fftp.itu.edu.tr%2FMirror%2FApache%2Fflex%2Fflexunit%2F4.2.0%2Fbinaries%2Fapache-flex-flexunit-4.2.0-4.12.0-bin.zip&amp;data=02%7C01%7Caharui%40adobe.com%7Ce20a0b440ab741580b6c08d6671546e2%7Cfa7b1b5a7b34438794aed2c178decee1%7C0%7C0%7C636809738447592451&amp;sdata=LM%2FWwquskztwCSq1etXF0Uy0Tef9tH5tJucA%2FXt3O6o%3D&amp;reserved=0>
    >
    > When try to download with right-click-save-as for  
    > https://na01.safelinks.protection.outlook.com/?url=http%3A%2F%2Fftp.itu.edu.tr%2FMirror%2FApache%2Fflex%2Fflexunit%2F4.2.0%2Fbinaries%2Fapache-flex-flexunit-4.2.0-4.12.0-bin.zip&amp;data=02%7C01%7Caharui%40adobe.com%7Ce20a0b440ab741580b6c08d6671546e2%7Cfa7b1b5a7b34438794aed2c178decee1%7C0%7C0%7C636809738447592451&amp;sdata=LM%2FWwquskztwCSq1etXF0Uy0Tef9tH5tJucA%2FXt3O6o%3D&amp;reserved=0<https://na01.safelinks.protection.outlook.com/?url=http%3A%2F%2Fftp.itu.edu.tr%2FMirror%2FApache%2Fflex%2Fflexunit%2F4.2.0%2Fbinaries%2Fapache-flex-flexunit-4.2.0-4.12.0-bin.zip&amp;data=02%7C01%7Caharui%40adobe.com%7Ce20a0b440ab741580b6c08d6671546e2%7Cfa7b1b5a7b34438794aed2c178decee1%7C0%7C0%7C636809738447592451&amp;sdata=LM%2FWwquskztwCSq1etXF0Uy0Tef9tH5tJucA%2FXt3O6o%3D&amp;reserved=0>, I get file not  
    > downloaded.
    >
    > When try to download with right-click-save-as for
    > <https://na01.safelinks.protection.outlook.com/?url=http%3A%2F%2Fftp.itu.edu.tr%2FMirror%2FApache%2Fflex%2Fflexunit%2F4.2.0%2Fbinaries%2Fapache-flex-flexunit-4.2.0-4.12.0-bin.zip&amp;data=02%7C01%7Caharui%40adobe.com%7Ce20a0b440ab741580b6c08d6671546e2%7Cfa7b1b5a7b34438794aed2c178decee1%7C0%7C0%7C636809738447602456&amp;sdata=sO5K2OlMfKznX1S5h7xDWPwYlBw34hQT45Lfx35ar70%3D&amp;reserved=0>
    > ftp://ftp.itu.edu.tr/Mirror/Apache/flex/flexunit/4.2.0/binaries/apache-flex-flexunit-4.2.0-4.12.0-bin.zip
    > or
    > https://na01.safelinks.protection.outlook.com/?url=https%3A%2F%2Fwww-us.apache.org%2Fdist%2Fflex%2Fflexunit%2F4.2.0%2Fbinaries%2Fapache-flex-flexunit-4.2.0-4.12.0-bin.zip&amp;data=02%7C01%7Caharui%40adobe.com%7Ce20a0b440ab741580b6c08d6671546e2%7Cfa7b1b5a7b34438794aed2c178decee1%7C0%7C0%7C636809738447602456&amp;sdata=y0VqG%2Fhs2LCSCH95d8GyW5CHnWoumePxCUDzodpymXE%3D&amp;reserved=0<https://na01.safelinks.protection.outlook.com/?url=https%3A%2F%2Fwww-us.apache.org%2Fdist%2Fflex%2Fflexunit%2F4.2.0%2Fbinaries%2Fapache-flex-flexunit-4.2.0-4.12.0-bin.zip&amp;data=02%7C01%7Caharui%40adobe.com%7Ce20a0b440ab741580b6c08d6671546e2%7Cfa7b1b5a7b34438794aed2c178decee1%7C0%7C0%7C636809738447602456&amp;sdata=y0VqG%2Fhs2LCSCH95d8GyW5CHnWoumePxCUDzodpymXE%3D&amp;reserved=0>
    > or  
    > <https://na01.safelinks.protection.outlook.com/?url=http%3A%2F%2Fftp.itu.edu.tr%2FMirror%2FApache%2Fflex%2Fflexunit%2F4.2.0%2Fbinaries%2Fapache-flex-flexunit-4.2.0-4.12.0-bin.zip&amp;data=02%7C01%7Caharui%40adobe.com%7Ce20a0b440ab741580b6c08d6671546e2%7Cfa7b1b5a7b34438794aed2c178decee1%7C0%7C0%7C636809738447602456&amp;sdata=sO5K2OlMfKznX1S5h7xDWPwYlBw34hQT45Lfx35ar70%3D&amp;reserved=0>
    > <https://na01.safelinks.protection.outlook.com/?url=http%3A%2F%2Fftp.itu.edu.tr%2FMirror%2FApache%2Fflex%2Fflexunit%2F4.2.0%2Fbinaries%2Fapache-flex-flexunit-4.2.0-4.12.0-bin.zip&amp;data=02%7C01%7Caharui%40adobe.com%7Ce20a0b440ab741580b6c08d6671546e2%7Cfa7b1b5a7b34438794aed2c178decee1%7C0%7C0%7C636809738447602456&amp;sdata=sO5K2OlMfKznX1S5h7xDWPwYlBw34hQT45Lfx35ar70%3D&amp;reserved=0>https://na01.safelinks.protection.outlook.com/?url=https%3A%2F%2Fwww-eu.apache.org%2Fdist%2Fflex%2Fflexunit%2F4.2.0%2Fbinaries%2Fapache-flex-flexunit-4.2.0-4.12.0-bin.zip&amp;data=02%7C01%7Caharui%40adobe.com%7Ce20a0b440ab741580b6c08d6671546e2%7Cfa7b1b5a7b34438794aed2c178decee1%7C0%7C0%7C636809738447602456&amp;sdata=l7zq7RzcgkSOS1Wh3lxtZiHBQQlHmr0zg4iRT51fx3E%3D&amp;reserved=0<https://na01.safelinks.protection.outlook.com/?url=https%3A%2F%2Fwww-eu.apache.org%2Fdist%2Fflex%2Fflexunit%2F4.2.0%2Fbinaries%2Fapache-flex-flexunit-4.2.0-4.12.0-bin.zip&amp;data=02%7C01%7Caharui%40adobe.com%7Ce20a0b440ab741580b6c08d6671546e2%7Cfa7b1b5a7b34438794aed2c178decee1%7C0%7C0%7C636809738447602456&amp;sdata=l7zq7RzcgkSOS1Wh3lxtZiHBQQlHmr0zg4iRT51fx3E%3D&amp;reserved=0>
    >
    > I get file downloaded completely.
    >
    > But the compiler uses the first one.
    >
    > Let me know it you need more information.
    >
    > Thanks,
    > Serkan
    > 18.12.2018 01:33 tarihinde Alex Harui yazdı:
    > Serkan,
    >
    > What Ant targets are you running?  Post a link to the console output  
    > including the ant command.
    >
    > I’m not sure why you say the mirror and file are broken.  What  
    > errors are you getting that indicate that it is broken?
    >
    > -Alex
    >
    > From: Serkan Taş  
    > [hidden email][hidden email]
    > Reply-To: [hidden email][hidden email]  
    > [hidden email][hidden email]
    > Date: Monday, December 17, 2018 at 12:52 PM
    > To: [hidden email][hidden email]  
    > [hidden email][hidden email]
    > Subject: Re: compiler is broken
    >
    > Hi,
    >
    > When I downloaded the zip file from the link  
    > https://na01.safelinks.protection.outlook.com/?url=https%3A%2F%2Fwww-eu.apache.org%2Fdist%2Fflex%2Fflexunit%2F4.2.0%2Fbinaries%2Fapache-flex-flexunit-4.2.0-4.12.0-bin.zip&amp;data=02%7C01%7Caharui%40adobe.com%7Ce20a0b440ab741580b6c08d6671546e2%7Cfa7b1b5a7b34438794aed2c178decee1%7C0%7C0%7C636809738447602456&amp;sdata=l7zq7RzcgkSOS1Wh3lxtZiHBQQlHmr0zg4iRT51fx3E%3D&amp;reserved=0<https://na01.safelinks.protection.outlook.com/?url=https%3A%2F%2Fwww-eu.apache.org%2Fdist%2Fflex%2Fflexunit%2F4.2.0%2Fbinaries%2Fapache-flex-flexunit-4.2.0-4.12.0-bin.zip&amp;data=02%7C01%7Caharui%40adobe.com%7Ce20a0b440ab741580b6c08d6671546e2%7Cfa7b1b5a7b34438794aed2c178decee1%7C0%7C0%7C636809738447602456&amp;sdata=l7zq7RzcgkSOS1Wh3lxtZiHBQQlHmr0zg4iRT51fx3E%3D&amp;reserved=0>
    > and put it into the folder royale-asjs/in, I expected the compiler  
    > should not delete, bud done so.
    > Two problems here:
    >
    > 1. The mirror and the file in apache is somehow broken :(e.g)  
    > https://na01.safelinks.protection.outlook.com/?url=http%3A%2F%2Fwww.apache.org%2Fdyn%2Fcloser.lua%2Fflex%2Fflexunit%2F4.2.0%2Fbinaries%2Fapache-flex-flexunit-4.2.0-4.12.0-bin.zip&amp;data=02%7C01%7Caharui%40adobe.com%7Ce20a0b440ab741580b6c08d6671546e2%7Cfa7b1b5a7b34438794aed2c178decee1%7C0%7C0%7C636809738447602456&amp;sdata=rQu5PqfrrqDwgTzqtN7PyoOXJ7p1SCDBhEDrjsU4Z6s%3D&amp;reserved=0<https://na01.safelinks.protection.outlook.com/?url=http%3A%2F%2Fwww.apache.org%2Fdyn%2Fcloser.lua%2Fflex%2Fflexunit%2F4.2.0%2Fbinaries%2Fapache-flex-flexunit-4.2.0-4.12.0-bin.zip&amp;data=02%7C01%7Caharui%40adobe.com%7Ce20a0b440ab741580b6c08d6671546e2%7Cfa7b1b5a7b34438794aed2c178decee1%7C0%7C0%7C636809738447602456&amp;sdata=rQu5PqfrrqDwgTzqtN7PyoOXJ7p1SCDBhEDrjsU4Z6s%3D&amp;reserved=0>
    > 2. File are deleted and downloaded each time during the build.
    >
    > May give some idea.
    >
    > It is not blocking me for now as I am using nightly builds unit I find a fix.
    >
    > Thanks,
    > Serkan
    >
    > 16.12.2018 22:53 tarihinde Serkan Taş yazdı:
    > This time it is ok, I tired  
    > https://na01.safelinks.protection.outlook.com/?url=https%3A%2F%2Fwww-eu.apache.org%2Fdist%2Fflex%2Fflexunit%2F4.2.0%2Fbinaries%2Fapache-flex-flexunit-4.2.0-4.12.0-bin.zip&amp;data=02%7C01%7Caharui%40adobe.com%7Ce20a0b440ab741580b6c08d6671546e2%7Cfa7b1b5a7b34438794aed2c178decee1%7C0%7C0%7C636809738447612462&amp;sdata=CYk%2F%2BKHm3kTqsnFHSQA17cAknxf4vNfVuC5XRmRS6gk%3D&amp;reserved=0<https://na01.safelinks.protection.outlook.com/?url=https%3A%2F%2Fwww-eu.apache.org%2Fdist%2Fflex%2Fflexunit%2F4.2.0%2Fbinaries%2Fapache-flex-flexunit-4.2.0-4.12.0-bin.zip&amp;data=02%7C01%7Caharui%40adobe.com%7Ce20a0b440ab741580b6c08d6671546e2%7Cfa7b1b5a7b34438794aed2c178decee1%7C0%7C0%7C636809738447612462&amp;sdata=CYk%2F%2BKHm3kTqsnFHSQA17cAknxf4vNfVuC5XRmRS6gk%3D&amp;reserved=0>
    >
    > Thanks,
    > Serkan
    > 16.12.2018 22:42 tarihinde Serkan Taş yazdı:
    > The link is not working Alex, just 16K is downloaded may be it is  
    > related with my environment.
    >
    > Thanks,
    > Serkan
    > 16.12.2018 10:04 tarihinde Alex Harui yazdı:
    > Hmm.  Maybe the cgi isn’t working.
    >
    > Try:  
    > https://na01.safelinks.protection.outlook.com/?url=http%3A%2F%2Fwww.apache.org%2Fdyn%2Fcloser.lua%2Fflex%2Fflexunit%2F4.2.0%2Fbinaries%2Fapache-flex-flexunit-4.2.0-4.12.0-bin.zip&amp;data=02%7C01%7Caharui%40adobe.com%7Ce20a0b440ab741580b6c08d6671546e2%7Cfa7b1b5a7b34438794aed2c178decee1%7C0%7C0%7C636809738447612462&amp;sdata=IDJmbSRFmjJzEyeB5CK83iL1BxZdnphhFxcblMGEeC4%3D&amp;reserved=0<https://na01.safelinks.protection.outlook.com/?url=http%3A%2F%2Fwww.apache.org%2Fdyn%2Fcloser.lua%2Fflex%2Fflexunit%2F4.2.0%2Fbinaries%2Fapache-flex-flexunit-4.2.0-4.12.0-bin.zip&amp;data=02%7C01%7Caharui%40adobe.com%7Ce20a0b440ab741580b6c08d6671546e2%7Cfa7b1b5a7b34438794aed2c178decee1%7C0%7C0%7C636809738447612462&amp;sdata=IDJmbSRFmjJzEyeB5CK83iL1BxZdnphhFxcblMGEeC4%3D&amp;reserved=0>
    >
    > HTH,
    > -Alex
    >
    > From: Serkan Taş  
    > [hidden email][hidden email]
    > Reply-To: [hidden email][hidden email]  
    > [hidden email][hidden email]
    > Date: Saturday, December 15, 2018 at 3:13 AM
    > To: [hidden email][hidden email]  
    > [hidden email][hidden email]
    > Subject: Re: compiler is broken
    >
    > I guess mirror is broken, is it possible to set not to use mirror ?
    > 14.12.2018 09:39 tarihinde Piotr Zarzycki yazdı:
    > To me the other solution was as well downloading that file and setup  
    > one of the environment variable CACHE - It always being checked  
    > during compilation whether file exists there. If not we are trying  
    > to download it.
    >
    > Find that variable if anything won't work.
    >
    > Thanks, Piotr
    >
    > czw., 13 gru 2018 o 23:17 Alex Harui  
    > <[hidden email][hidden email]> napisał(a):
    > Usually, your default browser cache, but sometimes clearing the  
    > Internet Explorer cache (even if you don’t use Internet Explorer)  
    > can help.
    >
    > Try downloading the file manually by clicking that link in a browser  
    > and run a checksum on the results and see you get something that can  
    > be unzipped.
    >
    > HTH,
    > -Alex
    >
    > From: Serkan Taş  
    > <[hidden email][hidden email]>
    > Reply-To: "[hidden email][hidden email]"  
    > <[hidden email][hidden email]>
    > Date: Thursday, December 13, 2018 at 1:56 PM
    > To: "[hidden email][hidden email]"  
    > <[hidden email][hidden email]>
    > Subject: Re: compiler is broken
    >
    > Hi Alex,
    >
    > Which browser cache should be cleaned ?
    >
    > Here is the download command from log :
    >
    > download_using_mirror:
    >       [get] Getting:  
    > https://na01.safelinks.protection.outlook.com/?url=http%3A%2F%2Fwww.apache.org%2Fdyn%2Fmirrors%2Fmirrors.cgi%2Fflex%2Fflexunit%2F4.2.0%2Fbinaries%2Fapache-flex-flexunit-4.2.0-4.12.0-bin.zip%3Fasjson%3Dtrue&amp;data=02%7C01%7Caharui%40adobe.com%7Ce20a0b440ab741580b6c08d6671546e2%7Cfa7b1b5a7b34438794aed2c178decee1%7C0%7C0%7C636809738447612462&amp;sdata=t4pFWAfEx28ru9js2qSh1f10lIvxrvVNRVpVLeCyZco%3D&amp;reserved=0<https://na01.safelinks.protection.outlook.com/?url=http%3A%2F%2Fwww.apache.org%2Fdyn%2Fmirrors%2Fmirrors.cgi%2Fflex%2Fflexunit%2F4.2.0%2Fbinaries%2Fapache-flex-flexunit-4.2.0-4.12.0-bin.zip%3Fasjson%3Dtrue&amp;data=02%7C01%7Caharui%40adobe.com%7Ce20a0b440ab741580b6c08d6671546e2%7Cfa7b1b5a7b34438794aed2c178decee1%7C0%7C0%7C636809738447612462&amp;sdata=t4pFWAfEx28ru9js2qSh1f10lIvxrvVNRVpVLeCyZco%3D&amp;reserved=0>
    >       [get] To:  
    > D:\dev\royale-emulation-works\github\royale-asjs\frameworks\mirror.json
    >       [get] .
    >
    > check_mirror_json:
    >
    > use_mirror:
    >    [delete] Deleting:  
    > D:\dev\royale-emulation-works\github\royale-asjs\frameworks\mirror.json
    >      [echo] Using mirror:  
    > https://na01.safelinks.protection.outlook.com/?url=http%3A%2F%2Fftp.itu.edu.tr%2FMirror%2FApache%2F&amp;data=02%7C01%7Caharui%40adobe.com%7Ce20a0b440ab741580b6c08d6671546e2%7Cfa7b1b5a7b34438794aed2c178decee1%7C0%7C0%7C636809738447612462&amp;sdata=mzbWZSmmHaCFGp9zejg0tBZtDEFzdkDQpGMOouoDqcY%3D&amp;reserved=0<https://na01.safelinks.protection.outlook.com/?url=http%3A%2F%2Fftp.itu.edu.tr%2FMirror%2FApache%2F&amp;data=02%7C01%7Caharui%40adobe.com%7Ce20a0b440ab741580b6c08d6671546e2%7Cfa7b1b5a7b34438794aed2c178decee1%7C0%7C0%7C636809738447612462&amp;sdata=mzbWZSmmHaCFGp9zejg0tBZtDEFzdkDQpGMOouoDqcY%3D&amp;reserved=0>
    >       [get] Getting:  
    > https://na01.safelinks.protection.outlook.com/?url=http%3A%2F%2Fftp.itu.edu.tr%2FMirror%2FApache%2Fflex%2Fflexunit%2F4.2.0%2Fbinaries%2Fapache-flex-flexunit-4.2.0-4.12.0-bin.zip&amp;data=02%7C01%7Caharui%40adobe.com%7Ce20a0b440ab741580b6c08d6671546e2%7Cfa7b1b5a7b34438794aed2c178decee1%7C0%7C0%7C636809738447612462&amp;sdata=otrhsbYcTHzs%2Bq4xZbP3D6m%2Fl%2FAYTeqALWHexQoFhwU%3D&amp;reserved=0<https://na01.safelinks.protection.outlook.com/?url=http%3A%2F%2Fftp.itu.edu.tr%2FMirror%2FApache%2Fflex%2Fflexunit%2F4.2.0%2Fbinaries%2Fapache-flex-flexunit-4.2.0-4.12.0-bin.zip&amp;data=02%7C01%7Caharui%40adobe.com%7Ce20a0b440ab741580b6c08d6671546e2%7Cfa7b1b5a7b34438794aed2c178decee1%7C0%7C0%7C636809738447612462&amp;sdata=otrhsbYcTHzs%2Bq4xZbP3D6m%2Fl%2FAYTeqALWHexQoFhwU%3D&amp;reserved=0>
    >       [get] To:  
    > D:\dev\royale-emulation-works\github\royale-asjs\in\apache-flex-flexunit-4.2.0-4.12.0-bin.zip
    >
    >
    >
    > And full log for reference :  
    > https://na01.safelinks.protection.outlook.com/?url=https%3A%2F%2Fdrive.google.com%2Fopen%3Fid%3D14rWYkD--Dv89nw8H1lJ1Dymg4IQVznKg&amp;data=02%7C01%7Caharui%40adobe.com%7Ce20a0b440ab741580b6c08d6671546e2%7Cfa7b1b5a7b34438794aed2c178decee1%7C0%7C0%7C636809738447612462&amp;sdata=r6j8hg%2BcVzfu7y4KzI6FfyT4rIJefXZkGBOWmg9dPfk%3D&amp;reserved=0<https://na01.safelinks.protection.outlook.com/?url=https%3A%2F%2Fdrive.google.com%2Fopen%3Fid%3D14rWYkD--Dv89nw8H1lJ1Dymg4IQVznKg&amp;data=02%7C01%7Caharui%40adobe.com%7Ce20a0b440ab741580b6c08d6671546e2%7Cfa7b1b5a7b34438794aed2c178decee1%7C0%7C0%7C636809738447612462&amp;sdata=r6j8hg%2BcVzfu7y4KzI6FfyT4rIJefXZkGBOWmg9dPfk%3D&amp;reserved=0>
    >
    > Thanks,
    > Serkan
    > 11.12.2018 22:09 tarihinde Alex Harui yazdı:
    > Hi Serkan,
    >
    > I don’t think that has anything to do with the compiler.  FlexUnit  
    > is for ActionScript unit tests.  I suggest that you clear your  
    > browser cache.  Sometimes the download libraries use browser  
    > libraries and a bad version of a file will be in a browser cache.
    >
    > HTH,
    > -Alex
    >
    > From: Serkan Taş  
    > [hidden email][hidden email]
    > Reply-To: [hidden email][hidden email]  
    > [hidden email][hidden email]
    > Date: Tuesday, December 11, 2018 at 11:05 AM
    > To: [hidden email][hidden email]  
    > [hidden email][hidden email]
    > Subject: compiler is broken
    >
    > Hi,
    >
    > When compiling royale I am getting error below. Any one has idea ?
    >
    > Here is the end of the log :
    >
    > get-from-cache-if-needed:
    >     [unzip] Expanding:  
    > D:\dev\royale-emulation-works\github\royale-asjs\in\apache-flex-flexunit-4.2.0-4.12.0-bin.zip into  
    > D:\dev\royale-emulation-works\github\royale-asjs\in\flexunit
    >
    > BUILD FAILED
    > D:\dev\royale-emulation-works\github\royale-asjs\build.xml:193: The  
    > following error occurred while executing this line:
    > D:\dev\royale-emulation-works\github\royale-asjs\frameworks\build.xml:106:  
    > The following error occurred while executing this line:
    > D:\dev\royale-emulation-works\github\royale-asjs\frameworks\downloads.xml:110: Error while expanding  
    > D:\dev\royale-emulation-works\github\royale-asjs\in\apache-flex-flexunit-4.2.0-4.12.0-bin.zip
    > java.util.zip.ZipException: archive is not a ZIP archive
    >         at  
    > org.apache.tools.zip.ZipFile.positionAtEndOfCentralDirectoryRecord(ZipFile.java:775)
    >         at  
    > org.apache.tools.zip.ZipFile.positionAtCentralDirectory(ZipFile.java:711)
    >         at  
    > org.apache.tools.zip.ZipFile.populateFromCentralDirectory(ZipFile.java:456)
    >         at org.apache.tools.zip.ZipFile.<init>(ZipFile.java:216)
    >         at org.apache.tools.ant.taskdefs.Expand.expandFile(Expand.java:190)
    >         at org.apache.tools.ant.taskdefs.Expand.execute(Expand.java:157)
    >         at  
    > org.apache.tools.ant.UnknownElement.execute(UnknownElement.java:292)
    >         at sun.reflect.GeneratedMethodAccessor4.invoke(Unknown Source)
    >         at  
    > sun.reflect.DelegatingMethodAccessorImpl.invoke(DelegatingMethodAccessorImpl.java:43)
    >         at java.lang.reflect.Method.invoke(Method.java:498)
    >         at  
    > org.apache.tools.ant.dispatch.DispatchUtils.execute(DispatchUtils.java:99)
    >         at org.apache.tools.ant.Task.perform(Task.java:350)
    >         at org.apache.tools.ant.Target.execute(Target.java:449)
    >         at org.apache.tools.ant.Target.performTasks(Target.java:470)
    >         at  
    > org.apache.tools.ant.Project.executeSortedTargets(Project.java:1388)
    >         at  
    > org.apache.tools.ant.helper.SingleCheckExecutor.executeTargets(SingleCheckExecutor.java:36)
    >         at org.apache.tools.ant.Project.executeTargets(Project.java:1251)
    >         at org.apache.tools.ant.taskdefs.Ant.execute(Ant.java:437)
    >         at  
    > org.apache.tools.ant.UnknownElement.execute(UnknownElement.java:292)
    >         at sun.reflect.GeneratedMethodAccessor4.invoke(Unknown Source)
    >         at  
    > sun.reflect.DelegatingMethodAccessorImpl.invoke(DelegatingMethodAccessorImpl.java:43)
    >         at java.lang.reflect.Method.invoke(Method.java:498)
    >         at  
    > org.apache.tools.ant.dispatch.DispatchUtils.execute(DispatchUtils.java:99)
    >         at org.apache.tools.ant.Task.perform(Task.java:350)
    >         at org.apache.tools.ant.Target.execute(Target.java:449)
    >         at org.apache.tools.ant.Target.performTasks(Target.java:470)
    >         at  
    > org.apache.tools.ant.Project.executeSortedTargets(Project.java:1388)
    >         at  
    > org.apache.tools.ant.helper.SingleCheckExecutor.executeTargets(SingleCheckExecutor.java:36)
    >         at org.apache.tools.ant.Project.executeTargets(Project.java:1251)
    >         at org.apache.tools.ant.taskdefs.Ant.execute(Ant.java:437)
    >         at  
    > org.apache.tools.ant.UnknownElement.execute(UnknownElement.java:292)
    >         at sun.reflect.GeneratedMethodAccessor4.invoke(Unknown Source)
    >         at  
    > sun.reflect.DelegatingMethodAccessorImpl.invoke(DelegatingMethodAccessorImpl.java:43)
    >         at java.lang.reflect.Method.invoke(Method.java:498)
    >         at  
    > org.apache.tools.ant.dispatch.DispatchUtils.execute(DispatchUtils.java:99)
    >         at org.apache.tools.ant.Task.perform(Task.java:350)
    >         at org.apache.tools.ant.Target.execute(Target.java:449)
    >         at org.apache.tools.ant.Target.performTasks(Target.java:470)
    >         at  
    > org.apache.tools.ant.Project.executeSortedTargets(Project.java:1388)
    >         at org.apache.tools.ant.Project.executeTarget(Project.java:1361)
    >         at  
    > org.apache.tools.ant.helper.DefaultExecutor.executeTargets(DefaultExecutor.java:41)
    >         at org.apache.tools.ant.Project.executeTargets(Project.java:1251)
    >         at org.apache.tools.ant.Main.runBuild(Main.java:834)
    >         at org.apache.tools.ant.Main.startAnt(Main.java:223)
    >         at org.apache.tools.ant.launch.Launcher.run(Launcher.java:284)
    >         at org.apache.tools.ant.launch.Launcher.main(Launcher.java:101)
    >
    > Total time: 3 minutes 44 seconds
    >
    >
    > Thanks,
    > Serkan
    >
    >
    >
    >
    >
    >
    >
    >
    > --
    >
    > Piotr Zarzycki
    >
    > Patreon:  
    > https://na01.safelinks.protection.outlook.com/?url=https%3A%2F%2Fwww.patreon.com%2Fpiotrzarzycki&amp;data=02%7C01%7Caharui%40adobe.com%7Ce20a0b440ab741580b6c08d6671546e2%7Cfa7b1b5a7b34438794aed2c178decee1%7C0%7C0%7C636809738447612462&amp;sdata=V%2BqbIuLoKZc443DtFZCH4t7k33NqPWNsCEATbbUhHC8%3D&amp;reserved=0<https://na01.safelinks.protection.outlook.com/?url=https%3A%2F%2Fwww.patreon.com%2Fpiotrzarzycki&amp;data=02%7C01%7Caharui%40adobe.com%7Ce20a0b440ab741580b6c08d6671546e2%7Cfa7b1b5a7b34438794aed2c178decee1%7C0%7C0%7C636809738447622476&amp;sdata=85onqL5u2NcsabQdJOAnR6Fp70cCE8%2FydARtBdr0NTs%3D&amp;reserved=0>
    
    
    -- 
    Serkan Taş
    Mobil : +90 532 250 07 71
    Likya Bilgi Teknolojileri
    ve İletişim Hiz. Ltd. Şti.
    https://na01.safelinks.protection.outlook.com/?url=www.likyateknoloji.com&amp;data=02%7C01%7Caharui%40adobe.com%7Ce20a0b440ab741580b6c08d6671546e2%7Cfa7b1b5a7b34438794aed2c178decee1%7C0%7C0%7C636809738447622476&amp;sdata=7kHkmhUN0TeV8xoTrPGl8rFt2Jjiyap2EBXRYl959Ik%3D&amp;reserved=0
    
    --------------------------------------
    Bu elektronik posta ve onunla iletilen bütün dosyalar gizlidir. Sadece  
    yukarıda isimleri belirtilen kişiler arasında özel haberleşme amacını  
    taşımaktadır. Size yanlışlıkla ulaşmışsa bu elektonik postanın  
    içeriğini açıklamanız, kopyalamanız, yönlendirmeniz ve kullanmanız  
    kesinlikle yasaktır. Lütfen mesajı geri gönderiniz ve sisteminizden  
    siliniz. Likya Bilgi Teknolojileri ve İletişim Hiz. Ltd. Şti. bu  
    mesajın içeriği ile ilgili olarak hiç bir hukuksal sorumluluğu kabul  
    etmez.
    
    This electronic mail and any files transmitted with it are intended  
    for the private use of  the persons named above. If you received this  
    message in error, forwarding, copying or use of any of the information  
    is strictly prohibited. Please immediately notify the sender and  
    delete it from your system. Likya Bilgi Teknolojileri ve İletişim Hiz.  
    Ltd. Şti. does not accept legal responsibility for the contents of  
    this message.
    --------------------------------------
    
    


12